{"text_format":"3","workbook":"xlsx","n_sheets":4,"sheets":["WordList","List of Skills","WordListByLesson","Sheet1"],"not_rendered":{"macros":1,"defined_names":6},"read":"whole","date_system":"1900"}

{"sheet":"WordList","index":0,"n_rows":764,"n_cols":20,"rows_kept":764}
[null,null,"Element 1:","German",{"$f":"D1 & \" to \" & D2","v":"German to English"},null,null,"Don’t change any orange",null,"Direction selecter -->",{"$f":"IF(O1=E1,1,2)","v":2},null,null,"Direction:","English to German"]
[null,null,"Element 2:","English",{"$f":"D2 & \" to \" & D1","v":"English to German"},null,null,"or any columns to the right",{"$nulls":5},"Skill Selection:"]
[{"$nulls":7},"of Cumulative when editing",{"$nulls":5},"Strength less than or equal to :"]
[null,"Skill","NounSort","Element 1","Element 1 prompt","Strength1","Element 2","Element 2 prompt","Strength2","Rand","TestAnswer","Strength","Prompt","Type Here","Comment","Answer",{"$nulls":3},"Skill Selection Table"]
[null,"40-Places",{"$f":"IF(AND(LEFT(D5,1)=\"d\",MID(D5,4,1)=\" \"),RIGHT(D5,LEN(D5)-4),D5)","v":"Gebäude"},"die Gebäude",null,0,"buildings","(edifaces)",-2,{"$f":"RAND()","v":0.8899979589408471},{"$f":"IF(Table24[[#This Row],[Type Here]]=\"\",\"\",IF(Table24[[#This Row],[Type Here]]=Table24[[#This Row],[Answer]],1,-2))","v":""},{"$f":"IF($K$1=1,Table24[[#This Row],[Strength1]],Table24[[#This Row],[Strength2]])","v":-2},{"$f":"IF($K$1=1,D5,G5)","v":"buildings"},null,{"$f":"IF($K$1=1,IF(E5=\"\",\"\",E5),IF(H5=\"\",\"\",H5))","v":"(edifaces)"},{"$f":"IF($K$1=1,G5,D5)","v":"die Gebäude"},{"$nulls":3},"01-Basics 1"]
["x","11-Family",{"$f":"IF(AND(LEFT(D6,1)=\"d\",MID(D6,4,1)=\" \"),RIGHT(D6,LEN(D6)-4),D6)","v":"Brüder"},"die Brüder",null,null,"brothers",null,null,{"$f":"RAND()","v":0.09505204416661317},{"$f":"IF(Table24[[#This Row],[Type Here]]=\"\",\"\",IF(Table24[[#This Row],[Type Here]]=Table24[[#This Row],[Answer]],1,-2))","v":""},{"$f":"IF($K$1=1,Table24[[#This Row],[Strength1]],Table24[[#This Row],[Strength2]])","v":0},{"$f":"IF($K$1=1,D6,G6)","v":"brothers"},null,{"$f":"IF($K$1=1,IF(E6=\"\",\"\",E6),IF(H6=\"\",\"\",H6))","v":""},{"$f":"IF($K$1=1,G6,D6)","v":"die Brüder"},{"$nulls":3},"02-Basics 2"]
[null,"14-Household",{"$f":"IF(AND(LEFT(D7,1)=\"d\",MID(D7,4,1)=\" \"),RIGHT(D7,LEN(D7)-4),D7)","v":"Möbel"},"die Möbel",null,0,"furnature",null,-4,{"$f":"RAND()","v":0.7915390709858218},{"$f":"IF(Table24[[#This Row],[Type Here]]=\"\",\"\",IF(Table24[[#This Row],[Type Here]]=Table24[[#This Row],[Answer]],1,-2))","v":""},{"$f":"IF($K$1=1,Table24[[#This Row],[Strength1]],Table24[[#This Row],[Strength2]])","v":-4},{"$f":"IF($K$1=1,D7,G7)","v":"furnature"},null,{"$f":"IF($K$1=1,IF(E7=\"\",\"\",E7),IF(H7=\"\",\"\",H7))","v":""},{"$f":"IF($K$1=1,G7,D7)","v":"die Möbel"},{"$nulls":3},"03-Phrases"]
[null,"29-Medical",{"$f":"IF(AND(LEFT(D8,1)=\"d\",MID(D8,4,1)=\" \"),RIGHT(D8,LEN(D8)-4),D8)","v":"krank"},"krank",null,0,"sick",null,5,{"$f":"RAND()","v":0.6529471821718318},{"$f":"IF(Table24[[#This Row],[Type Here]]=\"\",\"\",IF(Table24[[#This Row],[Type Here]]=Table24[[#This Row],[Answer]],1,-2))","v":""},{"$f":"IF($K$1=1,Table24[[#This Row],[Strength1]],Table24[[#This Row],[Strength2]])","v":5},{"$f":"IF($K$1=1,D8,G8)","v":"sick"},null,{"$f":"IF($K$1=1,IF(E8=\"\",\"\",E8),IF(H8=\"\",\"\",H8))","v":""},{"$f":"IF($K$1=1,G8,D8)","v":"krank"},{"$nulls":3},"04-Food"]
[null,"40-Places",{"$f":"IF(AND(LEFT(D9,1)=\"d\",MID(D9,4,1)=\" \"),RIGHT(D9,LEN(D9)-4),D9)","v":"Ringe"},"die Ringe",null,0,"rings","noun",0,{"$f":"RAND()","v":0.5340308765543536},{"$f":"IF(Table24[[#This Row],[Type Here]]=\"\",\"\",IF(Table24[[#This Row],[Type Here]]=Table24[[#This Row],[Answer]],1,-2))","v":""},{"$f":"IF($K$1=1,Table24[[#This Row],[Strength1]],Table24[[#This Row],[Strength2]])","v":0},{"$f":"IF($K$1=1,D9,G9)","v":"rings"},null,{"$f":"IF($K$1=1,IF(E9=\"\",\"\",E9),IF(H9=\"\",\"\",H9))","v":"noun"},{"$f":"IF($K$1=1,G9,D9)","v":"die Ringe"},{"$nulls":3},"05-Animals"]
[null,"33-Adverbs 1",{"$f":"IF(AND(LEFT(D10,1)=\"d\",MID(D10,4,1)=\" \"),RIGHT(D10,LEN(D10)-4),D10)","v":"daher"},"daher",null,0,"therefore","thence",0,{"$f":"RAND()","v":0.07505237430046097},{"$f":"IF(Table24[[#This Row],[Type Here]]=\"\",\"\",IF(Table24[[#This Row],[Type Here]]=Table24[[#This Row],[Answer]],1,-2))","v":""},{"$f":"IF($K$1=1,Table24[[#This Row],[Strength1]],Table24[[#This Row],[Strength2]])","v":0},{"$f":"IF($K$1=1,D10,G10)","v":"therefore"},null,{"$f":"IF($K$1=1,IF(E10=\"\",\"\",E10),IF(H10=\"\",\"\",H10))","v":"thence"},{"$f":"IF($K$1=1,G10,D10)","v":"daher"},{"$nulls":3},"06-Plurals"]
[null,"05-Animals",{"$f":"IF(AND(LEFT(D11,1)=\"d\",MID(D11,4,1)=\" \"),RIGHT(D11,LEN(D11)-4),D11)","v":"Hund"},"der Hund",null,0,"dog","noun",2,{"$f":"RAND()","v":0.06765786020556397},{"$f":"IF(Table24[[#This Row],[Type Here]]=\"\",\"\",IF(Table24[[#This Row],[Type Here]]=Table24[[#This Row],[Answer]],1,-2))","v":""},{"$f":"IF($K$1=1,Table24[[#This Row],[Strength1]],Table24[[#This Row],[Strength2]])","v":2},{"$f":"IF($K$1=1,D11,G11)","v":"dog"},null,{"$f":"IF($K$1=1,IF(E11=\"\",\"\",E11),IF(H11=\"\",\"\",H11))","v":"noun"},{"$f":"IF($K$1=1,G11,D11)","v":"der Hund"},{"$nulls":3},"07-Adjectives"]
[null,"39-Adj: Acc.",{"$f":"IF(AND(LEFT(D12,1)=\"d\",MID(D12,4,1)=\" \"),RIGHT(D12,LEN(D12)-4),D12)","v":"ehemalig"},"ehemalig",null,0,"former","(some time ago)",0,{"$f":"RAND()","v":0.20549445589673454},{"$f":"IF(Table24[[#This Row],[Type Here]]=\"\",\"\",IF(Table24[[#This Row],[Type Here]]=Table24[[#This Row],[Answer]],1,-2))","v":""},{"$f":"IF($K$1=1,Table24[[#This Row],[Strength1]],Table24[[#This Row],[Strength2]])","v":0},{"$f":"IF($K$1=1,D12,G12)","v":"former"},null,{"$f":"IF($K$1=1,IF(E12=\"\",\"\",E12),IF(H12=\"\",\"\",H12))","v":"(some time ago)"},{"$f":"IF($K$1=1,G12,D12)","v":"ehemalig"},{"$nulls":3},"08-V. Pres. 1"]
[null,"14-Household",{"$f":"IF(AND(LEFT(D13,1)=\"d\",MID(D13,4,1)=\" \"),RIGHT(D13,LEN(D13)-4),D13)","v":"Lampen"},"die Lampen",null,0,"lamps",null,1,{"$f":"RAND()","v":0.7108638006150212},{"$f":"IF(Table24[[#This Row],[Type Here]]=\"\",\"\",IF(Table24[[#This Row],[Type Here]]=Table24[[#This Row],[Answer]],1,-2))","v":""},{"$f":"IF($K$1=1,Table24[[#This Row],[Strength1]],Table24[[#This Row],[Strength2]])","v":1},{"$f":"IF($K$1=1,D13,G13)","v":"lamps"},null,{"$f":"IF($K$1=1,IF(E13=\"\",\"\",E13),IF(H13=\"\",\"\",H13))","v":""},{"$f":"IF($K$1=1,G13,D13)","v":"die Lampen"},{"$nulls":3},"09-Clothing"]
[null,"40-Places",{"$f":"IF(AND(LEFT(D14,1)=\"d\",MID(D14,4,1)=\" \"),RIGHT(D14,LEN(D14)-4),D14)","v":"Schloss"},"das Schloss",null,0,"castle",null,-5,{"$f":"RAND()","v":0.9660294150640655},{"$f":"IF(Table24[[#This Row],[Type Here]]=\"\",\"\",IF(Table24[[#This Row],[Type Here]]=Table24[[#This Row],[Answer]],1,-2))","v":""},{"$f":"IF($K$1=1,Table24[[#This Row],[Strength1]],Table24[[#This Row],[Strength2]])","v":-5},{"$f":"IF($K$1=1,D14,G14)","v":"castle"},null,{"$f":"IF($K$1=1,IF(E14=\"\",\"\",E14),IF(H14=\"\",\"\",H14))","v":""},{"$f":"IF($K$1=1,G14,D14)","v":"das Schloss"},{"$nulls":3},"10-Nom. Pron."]
[null,"11-Family",{"$f":"IF(AND(LEFT(D15,1)=\"d\",MID(D15,4,1)=\" \"),RIGHT(D15,LEN(D15)-4),D15)","v":"Familie"},"die Familie",null,null,"family",null,null,{"$f":"RAND()","v":0.24245575877367465},{"$f":"IF(Table24[[#This Row],[Type Here]]=\"\",\"\",IF(Table24[[#This Row],[Type Here]]=Table24[[#This Row],[Answer]],1,-2))","v":""},{"$f":"IF($K$1=1,Table24[[#This Row],[Strength1]],Table24[[#This Row],[Strength2]])","v":0},{"$f":"IF($K$1=1,D15,G15)","v":"family"},null,{"$f":"IF($K$1=1,IF(E15=\"\",\"\",E15),IF(H15=\"\",\"\",H15))","v":""},{"$f":"IF($K$1=1,G15,D15)","v":"die Familie"},{"$nulls":3},"11-Family"]
[null,"14-Household",{"$f":"IF(AND(LEFT(D16,1)=\"d\",MID(D16,4,1)=\" \"),RIGHT(D16,LEN(D16)-4),D16)","v":"Tische"},"die Tische",null,0,"tables",null,1,{"$f":"RAND()","v":0.29930582692175967},{"$f":"IF(Table24[[#This Row],[Type Here]]=\"\",\"\",IF(Table24[[#This Row],[Type Here]]=Table24[[#This Row],[Answer]],1,-2))","v":""},{"$f":"IF($K$1=1,Table24[[#This Row],[Strength1]],Table24[[#This Row],[Strength2]])","v":1},{"$f":"IF($K$1=1,D16,G16)","v":"tables"},null,{"$f":"IF($K$1=1,IF(E16=\"\",\"\",E16),IF(H16=\"\",\"\",H16))","v":""},{"$f":"IF($K$1=1,G16,D16)","v":"die Tische"},{"$nulls":3},"12-Acc. Pron."]
["x","39-Adj: Acc.",{"$f":"IF(AND(LEFT(D17,1)=\"d\",MID(D17,4,1)=\" \"),RIGHT(D17,LEN(D17)-4),D17)","v":"deutsch"},"deutsch",null,0,"German","adjective",10,{"$f":"RAND()","v":0.635547663473808},{"$f":"IF(Table24[[#This Row],[Type Here]]=\"\",\"\",IF(Table24[[#This Row],[Type Here]]=Table24[[#This Row],[Answer]],1,-2))","v":""},{"$f":"IF($K$1=1,Table24[[#This Row],[Strength1]],Table24[[#This Row],[Strength2]])","v":10},{"$f":"IF($K$1=1,D17,G17)","v":"German"},null,{"$f":"IF($K$1=1,IF(E17=\"\",\"\",E17),IF(H17=\"\",\"\",H17))","v":"adjective"},{"$f":"IF($K$1=1,G17,D17)","v":"deutsch"},{"$nulls":3},"14-Household"]
[null,"04-Food",{"$f":"IF(AND(LEFT(D18,1)=\"d\",MID(D18,4,1)=\" \"),RIGHT(D18,LEN(D18)-4),D18)","v":"Käse"},"der Käse",null,0,"cheese",null,3,{"$f":"RAND()","v":0.07926365178354977},{"$f":"IF(Table24[[#This Row],[Type Here]]=\"\",\"\",IF(Table24[[#This Row],[Type Here]]=Table24[[#This Row],[Answer]],1,-2))","v":""},{"$f":"IF($K$1=1,Table24[[#This Row],[Strength1]],Table24[[#This Row],[Strength2]])","v":3},{"$f":"IF($K$1=1,D18,G18)","v":"cheese"},null,{"$f":"IF($K$1=1,IF(E18=\"\",\"\",E18),IF(H18=\"\",\"\",H18))","v":""},{"$f":"IF($K$1=1,G18,D18)","v":"der Käse"},{"$nulls":3},"22-Colors"]
[null,"40-Places",{"$f":"IF(AND(LEFT(D19,1)=\"d\",MID(D19,4,1)=\" \"),RIGHT(D19,LEN(D19)-4),D19)","v":"Osten"},"der Osten",null,0,"east",null,0,{"$f":"RAND()","v":0.4890715452741483},{"$f":"IF(Table24[[#This Row],[Type Here]]=\"\",\"\",IF(Table24[[#This Row],[Type Here]]=Table24[[#This Row],[Answer]],1,-2))","v":""},{"$f":"IF($K$1=1,Table24[[#This Row],[Strength1]],Table24[[#This Row],[Strength2]])","v":0},{"$f":"IF($K$1=1,D19,G19)","v":"east"},null,{"$f":"IF($K$1=1,IF(E19=\"\",\"\",E19),IF(H19=\"\",\"\",H19))","v":""},{"$f":"IF($K$1=1,G19,D19)","v":"der Osten"},{"$nulls":3},"29-Medical"]
[null,"03-Phrases",{"$f":"IF(AND(LEFT(D20,1)=\"d\",MID(D20,4,1)=\" \"),RIGHT(D20,LEN(D20)-4),D20)","v":"Entschuldigungen"},"die Entschuldigungen",null,0,"apologies",null,0,{"$f":"RAND()","v":0.56965077138971},{"$f":"IF(Table24[[#This Row],[Type Here]]=\"\",\"\",IF(Table24[[#This Row],[Type Here]]=Table24[[#This Row],[Answer]],1,-2))","v":""},{"$f":"IF($K$1=1,Table24[[#This Row],[Strength1]],Table24[[#This Row],[Strength2]])","v":0},{"$f":"IF($K$1=1,D20,G20)","v":"apologies"},null,{"$f":"IF($K$1=1,IF(E20=\"\",\"\",E20),IF(H20=\"\",\"\",H20))","v":""},{"$f":"IF($K$1=1,G20,D20)","v":"die Entschuldigungen"},{"$nulls":3},"33-Adverbs 1"]
[null,"08-V. Pres. 1",{"$f":"IF(AND(LEFT(D21,1)=\"d\",MID(D21,4,1)=\" \"),RIGHT(D21,LEN(D21)-4),D21)","v":"verpassen"},"verpassen",null,0,"to miss","(to miss something, or to slip)",0,{"$f":"RAND()","v":0.896868561341785},{"$f":"IF(Table24[[#This Row],[Type Here]]=\"\",\"\",IF(Table24[[#This Row],[Type Here]]=Table24[[#This Row],[Answer]],1,-2))","v":""},{"$f":"IF($K$1=1,Table24[[#This Row],[Strength1]],Table24[[#This Row],[Strength2]])","v":0},{"$f":"IF($K$1=1,D21,G21)","v":"to miss"},null,{"$f":"IF($K$1=1,IF(E21=\"\",\"\",E21),IF(H21=\"\",\"\",H21))","v":"(to miss something, or to slip)"},{"$f":"IF($K$1=1,G21,D21)","v":"verpassen"},{"$nulls":3},"36-Nature"]
[null,"33-Adverbs 1",{"$f":"IF(AND(LEFT(D22,1)=\"d\",MID(D22,4,1)=\" \"),RIGHT(D22,LEN(D22)-4),D22)","v":"allein"},"allein",null,0,"alone",null,0,{"$f":"RAND()","v":0.44694677931372295},{"$f":"IF(Table24[[#This Row],[Type Here]]=\"\",\"\",IF(Table24[[#This Row],[Type Here]]=Table24[[#This Row],[Answer]],1,-2))","v":""},{"$f":"IF($K$1=1,Table24[[#This Row],[Strength1]],Table24[[#This Row],[Strength2]])","v":0},{"$f":"IF($K$1=1,D22,G22)","v":"alone"},null,{"$f":"IF($K$1=1,IF(E22=\"\",\"\",E22),IF(H22=\"\",\"\",H22))","v":""},{"$f":"IF($K$1=1,G22,D22)","v":"allein"},{"$nulls":3},"38-Ad: Nom. 1"]
[null,"40-Places",{"$f":"IF(AND(LEFT(D23,1)=\"d\",MID(D23,4,1)=\" \"),RIGHT(D23,LEN(D23)-4),D23)","v":"Ausland"},"das Ausland",null,0,"abroad",null,2,{"$f":"RAND()","v":0.2979175438183229},{"$f":"IF(Table24[[#This Row],[Type Here]]=\"\",\"\",IF(Table24[[#This Row],[Type Here]]=Table24[[#This Row],[Answer]],1,-2))","v":""},{"$f":"IF($K$1=1,Table24[[#This Row],[Strength1]],Table24[[#This Row],[Strength2]])","v":2},{"$f":"IF($K$1=1,D23,G23)","v":"abroad"},null,{"$f":"IF($K$1=1,IF(E23=\"\",\"\",E23),IF(H23=\"\",\"\",H23))","v":""},{"$f":"IF($K$1=1,G23,D23)","v":"das Ausland"},{"$nulls":3},"39-Adj: Acc."]
[null,"09-Clothing",{"$f":"IF(AND(LEFT(D24,1)=\"d\",MID(D24,4,1)=\" \"),RIGHT(D24,LEN(D24)-4),D24)","v":"Schuhe"},"die Schuhe",null,0,"shoes",null,1,{"$f":"RAND()","v":0.6066187329123973},{"$f":"IF(Table24[[#This Row],[Type Here]]=\"\",\"\",IF(Table24[[#This Row],[Type Here]]=Table24[[#This Row],[Answer]],1,-2))","v":""},{"$f":"IF($K$1=1,Table24[[#This Row],[Strength1]],Table24[[#This Row],[Strength2]])","v":1},{"$f":"IF($K$1=1,D24,G24)","v":"shoes"},null,{"$f":"IF($K$1=1,IF(E24=\"\",\"\",E24),IF(H24=\"\",\"\",H24))","v":""},{"$f":"IF($K$1=1,G24,D24)","v":"die Schuhe"},{"$nulls":3},"40-Places"]
[null,"01-Basics 1",{"$f":"IF(AND(LEFT(D25,1)=\"d\",MID(D25,4,1)=\" \"),RIGHT(D25,LEN(D25)-4),D25)","v":"die"},"die","(article - Acc plural",0,"the","Acc plural",0,{"$f":"RAND()","v":0.6100308814282651},{"$f":"IF(Table24[[#This Row],[Type Here]]=\"\",\"\",IF(Table24[[#This Row],[Type Here]]=Table24[[#This Row],[Answer]],1,-2))","v":""},{"$f":"IF($K$1=1,Table24[[#This Row],[Strength1]],Table24[[#This Row],[Strength2]])","v":0},{"$f":"IF($K$1=1,D25,G25)","v":"the"},null,{"$f":"IF($K$1=1,IF(E25=\"\",\"\",E25),IF(H25=\"\",\"\",H25))","v":"Acc plural"},{"$f":"IF($K$1=1,G25,D25)","v":"die"}]
[null,"14-Household",{"$f":"IF(AND(LEFT(D26,1)=\"d\",MID(D26,4,1)=\" \"),RIGHT(D26,LEN(D26)-4),D26)","v":"Bauten"},"die Bauten",null,0,"buildings",null,-2,{"$f":"RAND()","v":0.3205272311578059},{"$f":"IF(Table24[[#This Row],[Type Here]]=\"\",\"\",IF(Table24[[#This Row],[Type Here]]=Table24[[#This Row],[Answer]],1,-2))","v":""},{"$f":"IF($K$1=1,Table24[[#This Row],[Strength1]],Table24[[#This Row],[Strength2]])","v":-2},{"$f":"IF($K$1=1,D26,G26)","v":"buildings"},null,{"$f":"IF($K$1=1,IF(E26=\"\",\"\",E26),IF(H26=\"\",\"\",H26))","v":""},{"$f":"IF($K$1=1,G26,D26)","v":"die Bauten"}]
[null,"07-Adjectives",{"$f":"IF(AND(LEFT(D27,1)=\"d\",MID(D27,4,1)=\" \"),RIGHT(D27,LEN(D27)-4),D27)","v":"neu"},"neu",null,0,"new",null,3,{"$f":"RAND()","v":0.12523957012304465},{"$f":"IF(Table24[[#This Row],[Type Here]]=\"\",\"\",IF(Table24[[#This Row],[Type Here]]=Table24[[#This Row],[Answer]],1,-2))","v":""},{"$f":"IF($K$1=1,Table24[[#This Row],[Strength1]],Table24[[#This Row],[Strength2]])","v":3},{"$f":"IF($K$1=1,D27,G27)","v":"new"},null,{"$f":"IF($K$1=1,IF(E27=\"\",\"\",E27),IF(H27=\"\",\"\",H27))","v":""},{"$f":"IF($K$1=1,G27,D27)","v":"neu"}]
[null,"09-Clothing",{"$f":"IF(AND(LEFT(D28,1)=\"d\",MID(D28,4,1)=\" \"),RIGHT(D28,LEN(D28)-4),D28)","v":"Kleid"},"das Kleid",null,0,"dress",null,-1,{"$f":"RAND()","v":0.9985223341587931},{"$f":"IF(Table24[[#This Row],[Type Here]]=\"\",\"\",IF(Table24[[#This Row],[Type Here]]=Table24[[#This Row],[Answer]],1,-2))","v":""},{"$f":"IF($K$1=1,Table24[[#This Row],[Strength1]],Table24[[#This Row],[Strength2]])","v":-1},{"$f":"IF($K$1=1,D28,G28)","v":"dress"},null,{"$f":"IF($K$1=1,IF(E28=\"\",\"\",E28),IF(H28=\"\",\"\",H28))","v":""},{"$f":"IF($K$1=1,G28,D28)","v":"das Kleid"}]
[null,"33-Adverbs 1",{"$f":"IF(AND(LEFT(D29,1)=\"d\",MID(D29,4,1)=\" \"),RIGHT(D29,LEN(D29)-4),D29)","v":"gern"},"gern",null,0,"like","(emotion)",0,{"$f":"RAND()","v":0.1362067323543138},{"$f":"IF(Table24[[#This Row],[Type Here]]=\"\",\"\",IF(Table24[[#This Row],[Type Here]]=Table24[[#This Row],[Answer]],1,-2))","v":""},{"$f":"IF($K$1=1,Table24[[#This Row],[Strength1]],Table24[[#This Row],[Strength2]])","v":0},{"$f":"IF($K$1=1,D29,G29)","v":"like"},null,{"$f":"IF($K$1=1,IF(E29=\"\",\"\",E29),IF(H29=\"\",\"\",H29))","v":"(emotion)"},{"$f":"IF($K$1=1,G29,D29)","v":"gern"}]
[null,"14-Household",{"$f":"IF(AND(LEFT(D30,1)=\"d\",MID(D30,4,1)=\" \"),RIGHT(D30,LEN(D30)-4),D30)","v":"Gerät"},"das Gerät",null,0,"device",null,0,{"$f":"RAND()","v":0.6337437421124347},{"$f":"IF(Table24[[#This Row],[Type Here]]=\"\",\"\",IF(Table24[[#This Row],[Type Here]]=Table24[[#This Row],[Answer]],1,-2))","v":""},{"$f":"IF($K$1=1,Table24[[#This Row],[Strength1]],Table24[[#This Row],[Strength2]])","v":0},{"$f":"IF($K$1=1,D30,G30)","v":"device"},null,{"$f":"IF($K$1=1,IF(E30=\"\",\"\",E30),IF(H30=\"\",\"\",H30))","v":""},{"$f":"IF($K$1=1,G30,D30)","v":"das Gerät"}]
[null,"04-Food",{"$f":"IF(AND(LEFT(D31,1)=\"d\",MID(D31,4,1)=\" \"),RIGHT(D31,LEN(D31)-4),D31)","v":"Gemüse"},"die Gemüse",null,0,"vegetables",null,1,{"$f":"RAND()","v":0.30499910264494623},{"$f":"IF(Table24[[#This Row],[Type Here]]=\"\",\"\",IF(Table24[[#This Row],[Type Here]]=Table24[[#This Row],[Answer]],1,-2))","v":""},{"$f":"IF($K$1=1,Table24[[#This Row],[Strength1]],Table24[[#This Row],[Strength2]])","v":1},{"$f":"IF($K$1=1,D31,G31)","v":"vegetables"},null,{"$f":"IF($K$1=1,IF(E31=\"\",\"\",E31),IF(H31=\"\",\"\",H31))","v":""},{"$f":"IF($K$1=1,G31,D31)","v":"die Gemüse"}]
[null,"04-Food",{"$f":"IF(AND(LEFT(D32,1)=\"d\",MID(D32,4,1)=\" \"),RIGHT(D32,LEN(D32)-4),D32)","v":"Tomate"},"die Tomate",null,0,"tomato",null,3,{"$f":"RAND()","v":0.7946164149899787},{"$f":"IF(Table24[[#This Row],[Type Here]]=\"\",\"\",IF(Table24[[#This Row],[Type Here]]=Table24[[#This Row],[Answer]],1,-2))","v":""},{"$f":"IF($K$1=1,Table24[[#This Row],[Strength1]],Table24[[#This Row],[Strength2]])","v":3},{"$f":"IF($K$1=1,D32,G32)","v":"tomato"},null,{"$f":"IF($K$1=1,IF(E32=\"\",\"\",E32),IF(H32=\"\",\"\",H32))","v":""},{"$f":"IF($K$1=1,G32,D32)","v":"die Tomate"}]
[null,"36-Nature",{"$f":"IF(AND(LEFT(D33,1)=\"d\",MID(D33,4,1)=\" \"),RIGHT(D33,LEN(D33)-4),D33)","v":"Strände"},"die Strände",null,0,"beaches",null,6,{"$f":"RAND()","v":0.41158851934741036},{"$f":"IF(Table24[[#This Row],[Type Here]]=\"\",\"\",IF(Table24[[#This Row],[Type Here]]=Table24[[#This Row],[Answer]],1,-2))","v":""},{"$f":"IF($K$1=1,Table24[[#This Row],[Strength1]],Table24[[#This Row],[Strength2]])","v":6},{"$f":"IF($K$1=1,D33,G33)","v":"beaches"},null,{"$f":"IF($K$1=1,IF(E33=\"\",\"\",E33),IF(H33=\"\",\"\",H33))","v":""},{"$f":"IF($K$1=1,G33,D33)","v":"die Strände"}]
[null,"05-Animals",{"$f":"IF(AND(LEFT(D34,1)=\"d\",MID(D34,4,1)=\" \"),RIGHT(D34,LEN(D34)-4),D34)","v":"Ente"},"die Ente",null,0,"duck","noun",1,{"$f":"RAND()","v":0.3338325223504893},{"$f":"IF(Table24[[#This Row],[Type Here]]=\"\",\"\",IF(Table24[[#This Row],[Type Here]]=Table24[[#This Row],[Answer]],1,-2))","v":""},{"$f":"IF($K$1=1,Table24[[#This Row],[Strength1]],Table24[[#This Row],[Strength2]])","v":1},{"$f":"IF($K$1=1,D34,G34)","v":"duck"},null,{"$f":"IF($K$1=1,IF(E34=\"\",\"\",E34),IF(H34=\"\",\"\",H34))","v":"noun"},{"$f":"IF($K$1=1,G34,D34)","v":"die Ente"}]
[null,"40-Places",{"$f":"IF(AND(LEFT(D35,1)=\"d\",MID(D35,4,1)=\" \"),RIGHT(D35,LEN(D35)-4),D35)","v":"Station"},"die Station",null,0,"station","(general)",0,{"$f":"RAND()","v":0.9773156003301345},{"$f":"IF(Table24[[#This Row],[Type Here]]=\"\",\"\",IF(Table24[[#This Row],[Type Here]]=Table24[[#This Row],[Answer]],1,-2))","v":""},{"$f":"IF($K$1=1,Table24[[#This Row],[Strength1]],Table24[[#This Row],[Strength2]])","v":0},{"$f":"IF($K$1=1,D35,G35)","v":"station"},null,{"$f":"IF($K$1=1,IF(E35=\"\",\"\",E35),IF(H35=\"\",\"\",H35))","v":"(general)"},{"$f":"IF($K$1=1,G35,D35)","v":"die Station"}]
[null,"36-Nature",{"$f":"IF(AND(LEFT(D36,1)=\"d\",MID(D36,4,1)=\" \"),RIGHT(D36,LEN(D36)-4),D36)","v":"Blumen"},"die Blumen",null,0,"flowers",null,6,{"$f":"RAND()","v":0.42986693197063897},{"$f":"IF(Table24[[#This Row],[Type Here]]=\"\",\"\",IF(Table24[[#This Row],[Type Here]]=Table24[[#This Row],[Answer]],1,-2))","v":""},{"$f":"IF($K$1=1,Table24[[#This Row],[Strength1]],Table24[[#This Row],[Strength2]])","v":6},{"$f":"IF($K$1=1,D36,G36)","v":"flowers"},null,{"$f":"IF($K$1=1,IF(E36=\"\",\"\",E36),IF(H36=\"\",\"\",H36))","v":""},{"$f":"IF($K$1=1,G36,D36)","v":"die Blumen"}]
[null,"08-V. Pres. 1",{"$f":"IF(AND(LEFT(D37,1)=\"d\",MID(D37,4,1)=\" \"),RIGHT(D37,LEN(D37)-4),D37)","v":"rennen"},"rennen",null,0,"to run","(faster than laufen; sense of competition or speed)",0,{"$f":"RAND()","v":0.23582555154464924},{"$f":"IF(Table24[[#This Row],[Type Here]]=\"\",\"\",IF(Table24[[#This Row],[Type Here]]=Table24[[#This Row],[Answer]],1,-2))","v":""},{"$f":"IF($K$1=1,Table24[[#This Row],[Strength1]],Table24[[#This Row],[Strength2]])","v":0},{"$f":"IF($K$1=1,D37,G37)","v":"to run"},null,{"$f":"IF($K$1=1,IF(E37=\"\",\"\",E37),IF(H37=\"\",\"\",H37))","v":"(faster than laufen; sense of competition or speed)"},{"$f":"IF($K$1=1,G37,D37)","v":"rennen"}]
[null,"11-Family",{"$f":"IF(AND(LEFT(D38,1)=\"d\",MID(D38,4,1)=\" \"),RIGHT(D38,LEN(D38)-4),D38)","v":"Mütter"},"die Mütter",null,null,"mothers",null,null,{"$f":"RAND()","v":0.3061251442766867},{"$f":"IF(Table24[[#This Row],[Type Here]]=\"\",\"\",IF(Table24[[#This Row],[Type Here]]=Table24[[#This Row],[Answer]],1,-2))","v":""},{"$f":"IF($K$1=1,Table24[[#This Row],[Strength1]],Table24[[#This Row],[Strength2]])","v":0},{"$f":"IF($K$1=1,D38,G38)","v":"mothers"},null,{"$f":"IF($K$1=1,IF(E38=\"\",\"\",E38),IF(H38=\"\",\"\",H38))","v":""},{"$f":"IF($K$1=1,G38,D38)","v":"die Mütter"}]
[null,"04-Food",{"$f":"IF(AND(LEFT(D39,1)=\"d\",MID(D39,4,1)=\" \"),RIGHT(D39,LEN(D39)-4),D39)","v":"sauer"},"sauer","(the emotion)",0,"angry",null,2,{"$f":"RAND()","v":0.29803143294453793},{"$f":"IF(Table24[[#This Row],[Type Here]]=\"\",\"\",IF(Table24[[#This Row],[Type Here]]=Table24[[#This Row],[Answer]],1,-2))","v":""},{"$f":"IF($K$1=1,Table24[[#This Row],[Strength1]],Table24[[#This Row],[Strength2]])","v":2},{"$f":"IF($K$1=1,D39,G39)","v":"angry"},null,{"$f":"IF($K$1=1,IF(E39=\"\",\"\",E39),IF(H39=\"\",\"\",H39))","v":""},{"$f":"IF($K$1=1,G39,D39)","v":"sauer"}]
[null,"01-Basics 1",{"$f":"IF(AND(LEFT(D40,1)=\"d\",MID(D40,4,1)=\" \"),RIGHT(D40,LEN(D40)-4),D40)","v":"Mädchen"},"das Mädchen",null,0,"girl",null,0,{"$f":"RAND()","v":0.6199783780288918},{"$f":"IF(Table24[[#This Row],[Type Here]]=\"\",\"\",IF(Table24[[#This Row],[Type Here]]=Table24[[#This Row],[Answer]],1,-2))","v":""},{"$f":"IF($K$1=1,Table24[[#This Row],[Strength1]],Table24[[#This Row],[Strength2]])","v":0},{"$f":"IF($K$1=1,D40,G40)","v":"girl"},null,{"$f":"IF($K$1=1,IF(E40=\"\",\"\",E40),IF(H40=\"\",\"\",H40))","v":""},{"$f":"IF($K$1=1,G40,D40)","v":"das Mädchen"}]
[null,"09-Clothing",{"$f":"IF(AND(LEFT(D41,1)=\"d\",MID(D41,4,1)=\" \"),RIGHT(D41,LEN(D41)-4),D41)","v":"Hüte"},"die Hüte",null,0,"hats",null,1,{"$f":"RAND()","v":0.5323431170407793},{"$f":"IF(Table24[[#This Row],[Type Here]]=\"\",\"\",IF(Table24[[#This Row],[Type Here]]=Table24[[#This Row],[Answer]],1,-2))","v":""},{"$f":"IF($K$1=1,Table24[[#This Row],[Strength1]],Table24[[#This Row],[Strength2]])","v":1},{"$f":"IF($K$1=1,D41,G41)","v":"hats"},null,{"$f":"IF($K$1=1,IF(E41=\"\",\"\",E41),IF(H41=\"\",\"\",H41))","v":""},{"$f":"IF($K$1=1,G41,D41)","v":"die Hüte"}]
[null,"40-Places",{"$f":"IF(AND(LEFT(D42,1)=\"d\",MID(D42,4,1)=\" \"),RIGHT(D42,LEN(D42)-4),D42)","v":"Hotel"},"das Hotel",null,0,"hotel",null,4,{"$f":"RAND()","v":0.1321562056821871},{"$f":"IF(Table24[[#This Row],[Type Here]]=\"\",\"\",IF(Table24[[#This Row],[Type Here]]=Table24[[#This Row],[Answer]],1,-2))","v":""},{"$f":"IF($K$1=1,Table24[[#This Row],[Strength1]],Table24[[#This Row],[Strength2]])","v":4},{"$f":"IF($K$1=1,D42,G42)","v":"hotel"},null,{"$f":"IF($K$1=1,IF(E42=\"\",\"\",E42),IF(H42=\"\",\"\",H42))","v":""},{"$f":"IF($K$1=1,G42,D42)","v":"das Hotel"}]
[null,"36-Nature",{"$f":"IF(AND(LEFT(D43,1)=\"d\",MID(D43,4,1)=\" \"),RIGHT(D43,LEN(D43)-4),D43)","v":"All"},"das All",null,0,"space","(outer space)",6,{"$f":"RAND()","v":0.3577080591556604},{"$f":"IF(Table24[[#This Row],[Type Here]]=\"\",\"\",IF(Table24[[#This Row],[Type Here]]=Table24[[#This Row],[Answer]],1,-2))","v":""},{"$f":"IF($K$1=1,Table24[[#This Row],[Strength1]],Table24[[#This Row],[Strength2]])","v":6},{"$f":"IF($K$1=1,D43,G43)","v":"space"},null,{"$f":"IF($K$1=1,IF(E43=\"\",\"\",E43),IF(H43=\"\",\"\",H43))","v":"(outer space)"},{"$f":"IF($K$1=1,G43,D43)","v":"das All"}]
[null,"33-Adverbs 1",{"$f":"IF(AND(LEFT(D44,1)=\"d\",MID(D44,4,1)=\" \"),RIGHT(D44,LEN(D44)-4),D44)","v":"Ich bin dabei!"},"Ich bin dabei!",null,0,"I'm in!",null,0,{"$f":"RAND()","v":0.017210640278645384},{"$f":"IF(Table24[[#This Row],[Type Here]]=\"\",\"\",IF(Table24[[#This Row],[Type Here]]=Table24[[#This Row],[Answer]],1,-2))","v":""},{"$f":"IF($K$1=1,Table24[[#This Row],[Strength1]],Table24[[#This Row],[Strength2]])","v":0},{"$f":"IF($K$1=1,D44,G44)","v":"I'm in!"},null,{"$f":"IF($K$1=1,IF(E44=\"\",\"\",E44),IF(H44=\"\",\"\",H44))","v":""},{"$f":"IF($K$1=1,G44,D44)","v":"Ich bin dabei!"}]
[null,"05-Animals",{"$f":"IF(AND(LEFT(D45,1)=\"d\",MID(D45,4,1)=\" \"),RIGHT(D45,LEN(D45)-4),D45)","v":"Enten"},"die Enten",null,0,"ducks","noun",1,{"$f":"RAND()","v":0.6943235664738295},{"$f":"IF(Table24[[#This Row],[Type Here]]=\"\",\"\",IF(Table24[[#This Row],[Type Here]]=Table24[[#This Row],[Answer]],1,-2))","v":""},{"$f":"IF($K$1=1,Table24[[#This Row],[Strength1]],Table24[[#This Row],[Strength2]])","v":1},{"$f":"IF($K$1=1,D45,G45)","v":"ducks"},null,{"$f":"IF($K$1=1,IF(E45=\"\",\"\",E45),IF(H45=\"\",\"\",H45))","v":"noun"},{"$f":"IF($K$1=1,G45,D45)","v":"die Enten"}]
[null,"14-Household",{"$f":"IF(AND(LEFT(D46,1)=\"d\",MID(D46,4,1)=\" \"),RIGHT(D46,LEN(D46)-4),D46)","v":"Seife"},"die Seife",null,0,"soap",null,-2,{"$f":"RAND()","v":0.7296025290342797},{"$f":"IF(Table24[[#This Row],[Type Here]]=\"\",\"\",IF(Table24[[#This Row],[Type Here]]=Table24[[#This Row],[Answer]],1,-2))","v":""},{"$f":"IF($K$1=1,Table24[[#This Row],[Strength1]],Table24[[#This Row],[Strength2]])","v":-2},{"$f":"IF($K$1=1,D46,G46)","v":"soap"},null,{"$f":"IF($K$1=1,IF(E46=\"\",\"\",E46),IF(H46=\"\",\"\",H46))","v":""},{"$f":"IF($K$1=1,G46,D46)","v":"die Seife"}]
[null,"14-Household",{"$f":"IF(AND(LEFT(D47,1)=\"d\",MID(D47,4,1)=\" \"),RIGHT(D47,LEN(D47)-4),D47)","v":"Löffel"},"die Löffel",null,0,"spoons",null,1,{"$f":"RAND()","v":0.6366533000324424},{"$f":"IF(Table24[[#This Row],[Type Here]]=\"\",\"\",IF(Table24[[#This Row],[Type Here]]=Table24[[#This Row],[Answer]],1,-2))","v":""},{"$f":"IF($K$1=1,Table24[[#This Row],[Strength1]],Table24[[#This Row],[Strength2]])","v":1},{"$f":"IF($K$1=1,D47,G47)","v":"spoons"},null,{"$f":"IF($K$1=1,IF(E47=\"\",\"\",E47),IF(H47=\"\",\"\",H47))","v":""},{"$f":"IF($K$1=1,G47,D47)","v":"die Löffel"}]
[null,"02-Basics 2",{"$f":"IF(AND(LEFT(D48,1)=\"d\",MID(D48,4,1)=\" \"),RIGHT(D48,LEN(D48)-4),D48)","v":"Männer"},"die Männer","(gender)",0,"men",null,1,{"$f":"RAND()","v":0.9659798755892077},{"$f":"IF(Table24[[#This Row],[Type Here]]=\"\",\"\",IF(Table24[[#This Row],[Type Here]]=Table24[[#This Row],[Answer]],1,-2))","v":""},{"$f":"IF($K$1=1,Table24[[#This Row],[Strength1]],Table24[[#This Row],[Strength2]])","v":1},{"$f":"IF($K$1=1,D48,G48)","v":"men"},null,{"$f":"IF($K$1=1,IF(E48=\"\",\"\",E48),IF(H48=\"\",\"\",H48))","v":""},{"$f":"IF($K$1=1,G48,D48)","v":"die Männer"}]
[null,"04-Food",{"$f":"IF(AND(LEFT(D49,1)=\"d\",MID(D49,4,1)=\" \"),RIGHT(D49,LEN(D49)-4),D49)","v":"Säfte"},"die Säfte",null,0,"juices",null,2,{"$f":"RAND()","v":0.19593559328628463},{"$f":"IF(Table24[[#This Row],[Type Here]]=\"\",\"\",IF(Table24[[#This Row],[Type Here]]=Table24[[#This Row],[Answer]],1,-2))","v":""},{"$f":"IF($K$1=1,Table24[[#This Row],[Strength1]],Table24[[#This Row],[Strength2]])","v":2},{"$f":"IF($K$1=1,D49,G49)","v":"juices"},null,{"$f":"IF($K$1=1,IF(E49=\"\",\"\",E49),IF(H49=\"\",\"\",H49))","v":""},{"$f":"IF($K$1=1,G49,D49)","v":"die Säfte"}]
[null,"36-Nature",{"$f":"IF(AND(LEFT(D50,1)=\"d\",MID(D50,4,1)=\" \"),RIGHT(D50,LEN(D50)-4),D50)","v":"Sterne"},"die Sterne",null,0,"stars",null,6,{"$f":"RAND()","v":0.5128228773260803},{"$f":"IF(Table24[[#This Row],[Type Here]]=\"\",\"\",IF(Table24[[#This Row],[Type Here]]=Table24[[#This Row],[Answer]],1,-2))","v":""},{"$f":"IF($K$1=1,Table24[[#This Row],[Strength1]],Table24[[#This Row],[Strength2]])","v":6},{"$f":"IF($K$1=1,D50,G50)","v":"stars"},null,{"$f":"IF($K$1=1,IF(E50=\"\",\"\",E50),IF(H50=\"\",\"\",H50))","v":""},{"$f":"IF($K$1=1,G50,D50)","v":"die Sterne"}]
[null,"14-Household",{"$f":"IF(AND(LEFT(D51,1)=\"d\",MID(D51,4,1)=\" \"),RIGHT(D51,LEN(D51)-4),D51)","v":"Küchen"},"die Küchen",null,0,"kitchens",null,1,{"$f":"RAND()","v":0.6180914326562084},{"$f":"IF(Table24[[#This Row],[Type Here]]=\"\",\"\",IF(Table24[[#This Row],[Type Here]]=Table24[[#This Row],[Answer]],1,-2))","v":""},{"$f":"IF($K$1=1,Table24[[#This Row],[Strength1]],Table24[[#This Row],[Strength2]])","v":1},{"$f":"IF($K$1=1,D51,G51)","v":"kitchens"},null,{"$f":"IF($K$1=1,IF(E51=\"\",\"\",E51),IF(H51=\"\",\"\",H51))","v":""},{"$f":"IF($K$1=1,G51,D51)","v":"die Küchen"}]
[null,"33-Adverbs 1",{"$f":"IF(AND(LEFT(D52,1)=\"d\",MID(D52,4,1)=\" \"),RIGHT(D52,LEN(D52)-4),D52)","v":"es stimmt"},"es stimmt",null,0,"it is true",null,0,{"$f":"RAND()","v":0.7452411043656311},{"$f":"IF(Table24[[#This Row],[Type Here]]=\"\",\"\",IF(Table24[[#This Row],[Type Here]]=Table24[[#This Row],[Answer]],1,-2))","v":""},{"$f":"IF($K$1=1,Table24[[#This Row],[Strength1]],Table24[[#This Row],[Strength2]])","v":0},{"$f":"IF($K$1=1,D52,G52)","v":"it is true"},null,{"$f":"IF($K$1=1,IF(E52=\"\",\"\",E52),IF(H52=\"\",\"\",H52))","v":""},{"$f":"IF($K$1=1,G52,D52)","v":"es stimmt"}]
[null,"01-Basics 1",{"$f":"IF(AND(LEFT(D53,1)=\"d\",MID(D53,4,1)=\" \"),RIGHT(D53,LEN(D53)-4),D53)","v":"Frau"},"die Frau","(gender)",0,"woman",null,0,{"$f":"RAND()","v":0.36813551356290497},{"$f":"IF(Table24[[#This Row],[Type Here]]=\"\",\"\",IF(Table24[[#This Row],[Type Here]]=Table24[[#This Row],[Answer]],1,-2))","v":""},{"$f":"IF($K$1=1,Table24[[#This Row],[Strength1]],Table24[[#This Row],[Strength2]])","v":0},{"$f":"IF($K$1=1,D53,G53)","v":"woman"},null,{"$f":"IF($K$1=1,IF(E53=\"\",\"\",E53),IF(H53=\"\",\"\",H53))","v":""},{"$f":"IF($K$1=1,G53,D53)","v":"die Frau"}]
[null,"04-Food",{"$f":"IF(AND(LEFT(D54,1)=\"d\",MID(D54,4,1)=\" \"),RIGHT(D54,LEN(D54)-4),D54)","v":"Erdbeeren"},"die Erdbeeren",null,0,"strawberries",null,0,{"$f":"RAND()","v":0.5226154474979113},{"$f":"IF(Table24[[#This Row],[Type Here]]=\"\",\"\",IF(Table24[[#This Row],[Type Here]]=Table24[[#This Row],[Answer]],1,-2))","v":""},{"$f":"IF($K$1=1,Table24[[#This Row],[Strength1]],Table24[[#This Row],[Strength2]])","v":0},{"$f":"IF($K$1=1,D54,G54)","v":"strawberries"},null,{"$f":"IF($K$1=1,IF(E54=\"\",\"\",E54),IF(H54=\"\",\"\",H54))","v":""},{"$f":"IF($K$1=1,G54,D54)","v":"die Erdbeeren"}]
[null,"14-Household",{"$f":"IF(AND(LEFT(D55,1)=\"d\",MID(D55,4,1)=\" \"),RIGHT(D55,LEN(D55)-4),D55)","v":"Öl"},"das Öl",null,0,"oil",null,1,{"$f":"RAND()","v":0.01810004598402748},{"$f":"IF(Table24[[#This Row],[Type Here]]=\"\",\"\",IF(Table24[[#This Row],[Type Here]]=Table24[[#This Row],[Answer]],1,-2))","v":""},{"$f":"IF($K$1=1,Table24[[#This Row],[Strength1]],Table24[[#This Row],[Strength2]])","v":1},{"$f":"IF($K$1=1,D55,G55)","v":"oil"},null,{"$f":"IF($K$1=1,IF(E55=\"\",\"\",E55),IF(H55=\"\",\"\",H55))","v":""},{"$f":"IF($K$1=1,G55,D55)","v":"das Öl"}]
[null,"09-Clothing",{"$f":"IF(AND(LEFT(D56,1)=\"d\",MID(D56,4,1)=\" \"),RIGHT(D56,LEN(D56)-4),D56)","v":"Knopf"},"der Knopf",null,0,"button",null,1,{"$f":"RAND()","v":0.6816509233201816},{"$f":"IF(Table24[[#This Row],[Type Here]]=\"\",\"\",IF(Table24[[#This Row],[Type Here]]=Table24[[#This Row],[Answer]],1,-2))","v":""},{"$f":"IF($K$1=1,Table24[[#This Row],[Strength1]],Table24[[#This Row],[Strength2]])","v":1},{"$f":"IF($K$1=1,D56,G56)","v":"button"},null,{"$f":"IF($K$1=1,IF(E56=\"\",\"\",E56),IF(H56=\"\",\"\",H56))","v":""},{"$f":"IF($K$1=1,G56,D56)","v":"der Knopf"}]
[null,"40-Places",{"$f":"IF(AND(LEFT(D57,1)=\"d\",MID(D57,4,1)=\" \"),RIGHT(D57,LEN(D57)-4),D57)","v":"Gründe"},"die Gründe",null,0,"grounds","(also reasons, basis)",3,{"$f":"RAND()","v":0.15724225641790812},{"$f":"IF(Table24[[#This Row],[Type Here]]=\"\",\"\",IF(Table24[[#This Row],[Type Here]]=Table24[[#This Row],[Answer]],1,-2))","v":""},{"$f":"IF($K$1=1,Table24[[#This Row],[Strength1]],Table24[[#This Row],[Strength2]])","v":3},{"$f":"IF($K$1=1,D57,G57)","v":"grounds"},null,{"$f":"IF($K$1=1,IF(E57=\"\",\"\",E57),IF(H57=\"\",\"\",H57))","v":"(also reasons, basis)"},{"$f":"IF($K$1=1,G57,D57)","v":"die Gründe"}]
[null,"36-Nature",{"$f":"IF(AND(LEFT(D58,1)=\"d\",MID(D58,4,1)=\" \"),RIGHT(D58,LEN(D58)-4),D58)","v":"Hölzer"},"die Hölzer",null,0,"woods","(timbers)",2,{"$f":"RAND()","v":0.5329345734149173},{"$f":"IF(Table24[[#This Row],[Type Here]]=\"\",\"\",IF(Table24[[#This Row],[Type Here]]=Table24[[#This Row],[Answer]],1,-2))","v":""},{"$f":"IF($K$1=1,Table24[[#This Row],[Strength1]],Table24[[#This Row],[Strength2]])","v":2},{"$f":"IF($K$1=1,D58,G58)","v":"woods"},null,{"$f":"IF($K$1=1,IF(E58=\"\",\"\",E58),IF(H58=\"\",\"\",H58))","v":"(timbers)"},{"$f":"IF($K$1=1,G58,D58)","v":"die Hölzer"}]
[null,"14-Household",{"$f":"IF(AND(LEFT(D59,1)=\"d\",MID(D59,4,1)=\" \"),RIGHT(D59,LEN(D59)-4),D59)","v":"Geräte"},"die Geräte",null,0,"devices",null,-1,{"$f":"RAND()","v":0.5020047690228724},{"$f":"IF(Table24[[#This Row],[Type Here]]=\"\",\"\",IF(Table24[[#This Row],[Type Here]]=Table24[[#This Row],[Answer]],1,-2))","v":""},{"$f":"IF($K$1=1,Table24[[#This Row],[Strength1]],Table24[[#This Row],[Strength2]])","v":-1},{"$f":"IF($K$1=1,D59,G59)","v":"devices"},null,{"$f":"IF($K$1=1,IF(E59=\"\",\"\",E59),IF(H59=\"\",\"\",H59))","v":""},{"$f":"IF($K$1=1,G59,D59)","v":"die Geräte"}]
[null,"07-Adjectives",{"$f":"IF(AND(LEFT(D60,1)=\"d\",MID(D60,4,1)=\" \"),RIGHT(D60,LEN(D60)-4),D60)","v":"fest"},"fest",null,0,"tight","(firm)",0,{"$f":"RAND()","v":0.5870224960153182},{"$f":"IF(Table24[[#This Row],[Type Here]]=\"\",\"\",IF(Table24[[#This Row],[Type Here]]=Table24[[#This Row],[Answer]],1,-2))","v":""},{"$f":"IF($K$1=1,Table24[[#This Row],[Strength1]],Table24[[#This Row],[Strength2]])","v":0},{"$f":"IF($K$1=1,D60,G60)","v":"tight"},null,{"$f":"IF($K$1=1,IF(E60=\"\",\"\",E60),IF(H60=\"\",\"\",H60))","v":"(firm)"},{"$f":"IF($K$1=1,G60,D60)","v":"fest"}]
[null,"36-Nature",{"$f":"IF(AND(LEFT(D61,1)=\"d\",MID(D61,4,1)=\" \"),RIGHT(D61,LEN(D61)-4),D61)","v":"Klima"},"das Klima",null,0,"climate",null,6,{"$f":"RAND()","v":0.49687458588399935},{"$f":"IF(Table24[[#This Row],[Type Here]]=\"\",\"\",IF(Table24[[#This Row],[Type Here]]=Table24[[#This Row],[Answer]],1,-2))","v":""},{"$f":"IF($K$1=1,Table24[[#This Row],[Strength1]],Table24[[#This Row],[Strength2]])","v":6},{"$f":"IF($K$1=1,D61,G61)","v":"climate"},null,{"$f":"IF($K$1=1,IF(E61=\"\",\"\",E61),IF(H61=\"\",\"\",H61))","v":""},{"$f":"IF($K$1=1,G61,D61)","v":"das Klima"}]
[null,"14-Household",{"$f":"IF(AND(LEFT(D62,1)=\"d\",MID(D62,4,1)=\" \"),RIGHT(D62,LEN(D62)-4),D62)","v":"Glas"},"das Glas",null,0,"glass",null,1,{"$f":"RAND()","v":0.8004881285782081},{"$f":"IF(Table24[[#This Row],[Type Here]]=\"\",\"\",IF(Table24[[#This Row],[Type Here]]=Table24[[#This Row],[Answer]],1,-2))","v":""},{"$f":"IF($K$1=1,Table24[[#This Row],[Strength1]],Table24[[#This Row],[Strength2]])","v":1},{"$f":"IF($K$1=1,D62,G62)","v":"glass"},null,{"$f":"IF($K$1=1,IF(E62=\"\",\"\",E62),IF(H62=\"\",\"\",H62))","v":""},{"$f":"IF($K$1=1,G62,D62)","v":"das Glas"}]
[null,"01-Basics 1",{"$f":"IF(AND(LEFT(D63,1)=\"d\",MID(D63,4,1)=\" \"),RIGHT(D63,LEN(D63)-4),D63)","v":"ein"},"ein","(article - Nom masc)",0,"a","Nom masc",1,{"$f":"RAND()","v":0.6322929876625077},{"$f":"IF(Table24[[#This Row],[Type Here]]=\"\",\"\",IF(Table24[[#This Row],[Type Here]]=Table24[[#This Row],[Answer]],1,-2))","v":""},{"$f":"IF($K$1=1,Table24[[#This Row],[Strength1]],Table24[[#This Row],[Strength2]])","v":1},{"$f":"IF($K$1=1,D63,G63)","v":"a"},null,{"$f":"IF($K$1=1,IF(E63=\"\",\"\",E63),IF(H63=\"\",\"\",H63))","v":"Nom masc"},{"$f":"IF($K$1=1,G63,D63)","v":"ein"}]
[null,"29-Medical",{"$f":"IF(AND(LEFT(D64,1)=\"d\",MID(D64,4,1)=\" \"),RIGHT(D64,LEN(D64)-4),D64)","v":"Haut"},"die Haut",null,0,"skin","anatomy",0,{"$f":"RAND()","v":0.9284051178381872},{"$f":"IF(Table24[[#This Row],[Type Here]]=\"\",\"\",IF(Table24[[#This Row],[Type Here]]=Table24[[#This Row],[Answer]],1,-2))","v":""},{"$f":"IF($K$1=1,Table24[[#This Row],[Strength1]],Table24[[#This Row],[Strength2]])","v":0},{"$f":"IF($K$1=1,D64,G64)","v":"skin"},null,{"$f":"IF($K$1=1,IF(E64=\"\",\"\",E64),IF(H64=\"\",\"\",H64))","v":"anatomy"},{"$f":"IF($K$1=1,G64,D64)","v":"die Haut"}]
[null,"29-Medical",{"$f":"IF(AND(LEFT(D65,1)=\"d\",MID(D65,4,1)=\" \"),RIGHT(D65,LEN(D65)-4),D65)","v":"Körper"},"der Körper",null,0,"body","anatomy",1,{"$f":"RAND()","v":0.8847412956696039},{"$f":"IF(Table24[[#This Row],[Type Here]]=\"\",\"\",IF(Table24[[#This Row],[Type Here]]=Table24[[#This Row],[Answer]],1,-2))","v":""},{"$f":"IF($K$1=1,Table24[[#This Row],[Strength1]],Table24[[#This Row],[Strength2]])","v":1},{"$f":"IF($K$1=1,D65,G65)","v":"body"},null,{"$f":"IF($K$1=1,IF(E65=\"\",\"\",E65),IF(H65=\"\",\"\",H65))","v":"anatomy"},{"$f":"IF($K$1=1,G65,D65)","v":"der Körper"}]
[null,"11-Family",{"$f":"IF(AND(LEFT(D66,1)=\"d\",MID(D66,4,1)=\" \"),RIGHT(D66,LEN(D66)-4),D66)","v":"Beziehungen"},"die Beziehungen",null,null,"relationships",null,null,{"$f":"RAND()","v":0.6471684448827978},{"$f":"IF(Table24[[#This Row],[Type Here]]=\"\",\"\",IF(Table24[[#This Row],[Type Here]]=Table24[[#This Row],[Answer]],1,-2))","v":""},{"$f":"IF($K$1=1,Table24[[#This Row],[Strength1]],Table24[[#This Row],[Strength2]])","v":0},{"$f":"IF($K$1=1,D66,G66)","v":"relationships"},null,{"$f":"IF($K$1=1,IF(E66=\"\",\"\",E66),IF(H66=\"\",\"\",H66))","v":""},{"$f":"IF($K$1=1,G66,D66)","v":"die Beziehungen"}]
[null,"11-Family",{"$f":"IF(AND(LEFT(D67,1)=\"d\",MID(D67,4,1)=\" \"),RIGHT(D67,LEN(D67)-4),D67)","v":"Hochzeit"},"die Hochzeit",null,null,"wedding",null,null,{"$f":"RAND()","v":0.4669131802824882},{"$f":"IF(Table24[[#This Row],[Type Here]]=\"\",\"\",IF(Table24[[#This Row],[Type Here]]=Table24[[#This Row],[Answer]],1,-2))","v":""},{"$f":"IF($K$1=1,Table24[[#This Row],[Strength1]],Table24[[#This Row],[Strength2]])","v":0},{"$f":"IF($K$1=1,D67,G67)","v":"wedding"},null,{"$f":"IF($K$1=1,IF(E67=\"\",\"\",E67),IF(H67=\"\",\"\",H67))","v":""},{"$f":"IF($K$1=1,G67,D67)","v":"die Hochzeit"}]
[null,"05-Animals",{"$f":"IF(AND(LEFT(D68,1)=\"d\",MID(D68,4,1)=\" \"),RIGHT(D68,LEN(D68)-4),D68)","v":"Kühe"},"die Kühe",null,0,"cows",null,0,{"$f":"RAND()","v":0.8295854779513923},{"$f":"IF(Table24[[#This Row],[Type Here]]=\"\",\"\",IF(Table24[[#This Row],[Type Here]]=Table24[[#This Row],[Answer]],1,-2))","v":""},{"$f":"IF($K$1=1,Table24[[#This Row],[Strength1]],Table24[[#This Row],[Strength2]])","v":0},{"$f":"IF($K$1=1,D68,G68)","v":"cows"},null,{"$f":"IF($K$1=1,IF(E68=\"\",\"\",E68),IF(H68=\"\",\"\",H68))","v":""},{"$f":"IF($K$1=1,G68,D68)","v":"die Kühe"}]
[null,"36-Nature",{"$f":"IF(AND(LEFT(D69,1)=\"d\",MID(D69,4,1)=\" \"),RIGHT(D69,LEN(D69)-4),D69)","v":"Klimas"},"die Klimas",null,0,"climates",null,6,{"$f":"RAND()","v":0.2746619960477842},{"$f":"IF(Table24[[#This Row],[Type Here]]=\"\",\"\",IF(Table24[[#This Row],[Type Here]]=Table24[[#This Row],[Answer]],1,-2))","v":""},{"$f":"IF($K$1=1,Table24[[#This Row],[Strength1]],Table24[[#This Row],[Strength2]])","v":6},{"$f":"IF($K$1=1,D69,G69)","v":"climates"},null,{"$f":"IF($K$1=1,IF(E69=\"\",\"\",E69),IF(H69=\"\",\"\",H69))","v":""},{"$f":"IF($K$1=1,G69,D69)","v":"die Klimas"}]
[null,"40-Places",{"$f":"IF(AND(LEFT(D70,1)=\"d\",MID(D70,4,1)=\" \"),RIGHT(D70,LEN(D70)-4),D70)","v":"Bundesland"},"das Bundesland",null,0,"state","federal state",0,{"$f":"RAND()","v":0.5064856001337884},{"$f":"IF(Table24[[#This Row],[Type Here]]=\"\",\"\",IF(Table24[[#This Row],[Type Here]]=Table24[[#This Row],[Answer]],1,-2))","v":""},{"$f":"IF($K$1=1,Table24[[#This Row],[Strength1]],Table24[[#This Row],[Strength2]])","v":0},{"$f":"IF($K$1=1,D70,G70)","v":"state"},null,{"$f":"IF($K$1=1,IF(E70=\"\",\"\",E70),IF(H70=\"\",\"\",H70))","v":"federal state"},{"$f":"IF($K$1=1,G70,D70)","v":"das Bundesland"}]
[null,"04-Food",{"$f":"IF(AND(LEFT(D71,1)=\"d\",MID(D71,4,1)=\" \"),RIGHT(D71,LEN(D71)-4),D71)","v":"Kaffee"},"der Kaffee",null,0,"coffee",null,4,{"$f":"RAND()","v":0.3758030100149137},{"$f":"IF(Table24[[#This Row],[Type Here]]=\"\",\"\",IF(Table24[[#This Row],[Type Here]]=Table24[[#This Row],[Answer]],1,-2))","v":""},{"$f":"IF($K$1=1,Table24[[#This Row],[Strength1]],Table24[[#This Row],[Strength2]])","v":4},{"$f":"IF($K$1=1,D71,G71)","v":"coffee"},null,{"$f":"IF($K$1=1,IF(E71=\"\",\"\",E71),IF(H71=\"\",\"\",H71))","v":""},{"$f":"IF($K$1=1,G71,D71)","v":"der Kaffee"}]
[null,"04-Food",{"$f":"IF(AND(LEFT(D72,1)=\"d\",MID(D72,4,1)=\" \"),RIGHT(D72,LEN(D72)-4),D72)","v":"Hähnchen"},"die Hähnchen",null,0,"chickens",null,0,{"$f":"RAND()","v":0.6104708521801008},{"$f":"IF(Table24[[#This Row],[Type Here]]=\"\",\"\",IF(Table24[[#This Row],[Type Here]]=Table24[[#This Row],[Answer]],1,-2))","v":""},{"$f":"IF($K$1=1,Table24[[#This Row],[Strength1]],Table24[[#This Row],[Strength2]])","v":0},{"$f":"IF($K$1=1,D72,G72)","v":"chickens"},null,{"$f":"IF($K$1=1,IF(E72=\"\",\"\",E72),IF(H72=\"\",\"\",H72))","v":""},{"$f":"IF($K$1=1,G72,D72)","v":"die Hähnchen"}]
[null,"38-Ad: Nom. 1",{"$f":"IF(AND(LEFT(D73,1)=\"d\",MID(D73,4,1)=\" \"),RIGHT(D73,LEN(D73)-4),D73)","v":"aktuell"},"aktuell",null,0,"current","(up to date)",4,{"$f":"RAND()","v":0.348392310535104},{"$f":"IF(Table24[[#This Row],[Type Here]]=\"\",\"\",IF(Table24[[#This Row],[Type Here]]=Table24[[#This Row],[Answer]],1,-2))","v":""},{"$f":"IF($K$1=1,Table24[[#This Row],[Strength1]],Table24[[#This Row],[Strength2]])","v":4},{"$f":"IF($K$1=1,D73,G73)","v":"current"},null,{"$f":"IF($K$1=1,IF(E73=\"\",\"\",E73),IF(H73=\"\",\"\",H73))","v":"(up to date)"},{"$f":"IF($K$1=1,G73,D73)","v":"aktuell"}]
[null,"03-Phrases",{"$f":"IF(AND(LEFT(D74,1)=\"d\",MID(D74,4,1)=\" \"),RIGHT(D74,LEN(D74)-4),D74)","v":"danke"},"danke",null,0,"thanks",null,1,{"$f":"RAND()","v":0.9107001121738834},{"$f":"IF(Table24[[#This Row],[Type Here]]=\"\",\"\",IF(Table24[[#This Row],[Type Here]]=Table24[[#This Row],[Answer]],1,-2))","v":""},{"$f":"IF($K$1=1,Table24[[#This Row],[Strength1]],Table24[[#This Row],[Strength2]])","v":1},{"$f":"IF($K$1=1,D74,G74)","v":"thanks"},null,{"$f":"IF($K$1=1,IF(E74=\"\",\"\",E74),IF(H74=\"\",\"\",H74))","v":""},{"$f":"IF($K$1=1,G74,D74)","v":"danke"}]
[null,"40-Places",{"$f":"IF(AND(LEFT(D75,1)=\"d\",MID(D75,4,1)=\" \"),RIGHT(D75,LEN(D75)-4),D75)","v":"Parks"},"die Parks",null,0,"parks","noun",4,{"$f":"RAND()","v":0.19660466837582136},{"$f":"IF(Table24[[#This Row],[Type Here]]=\"\",\"\",IF(Table24[[#This Row],[Type Here]]=Table24[[#This Row],[Answer]],1,-2))","v":""},{"$f":"IF($K$1=1,Table24[[#This Row],[Strength1]],Table24[[#This Row],[Strength2]])","v":4},{"$f":"IF($K$1=1,D75,G75)","v":"parks"},null,{"$f":"IF($K$1=1,IF(E75=\"\",\"\",E75),IF(H75=\"\",\"\",H75))","v":"noun"},{"$f":"IF($K$1=1,G75,D75)","v":"die Parks"}]
[null,"14-Household",{"$f":"IF(AND(LEFT(D76,1)=\"d\",MID(D76,4,1)=\" \"),RIGHT(D76,LEN(D76)-4),D76)","v":"Fenster"},"die Fenster",null,0,"windows",null,1,{"$f":"RAND()","v":0.32757764377472864},{"$f":"IF(Table24[[#This Row],[Type Here]]=\"\",\"\",IF(Table24[[#This Row],[Type Here]]=Table24[[#This Row],[Answer]],1,-2))","v":""},{"$f":"IF($K$1=1,Table24[[#This Row],[Strength1]],Table24[[#This Row],[Strength2]])","v":1},{"$f":"IF($K$1=1,D76,G76)","v":"windows"},null,{"$f":"IF($K$1=1,IF(E76=\"\",\"\",E76),IF(H76=\"\",\"\",H76))","v":""},{"$f":"IF($K$1=1,G76,D76)","v":"die Fenster"}]
[null,"14-Household",{"$f":"IF(AND(LEFT(D77,1)=\"d\",MID(D77,4,1)=\" \"),RIGHT(D77,LEN(D77)-4),D77)","v":"Bad"},"das Bad",null,0,"bath",null,1,{"$f":"RAND()","v":0.8555327358064391},{"$f":"IF(Table24[[#This Row],[Type Here]]=\"\",\"\",IF(Table24[[#This Row],[Type Here]]=Table24[[#This Row],[Answer]],1,-2))","v":""},{"$f":"IF($K$1=1,Table24[[#This Row],[Strength1]],Table24[[#This Row],[Strength2]])","v":1},{"$f":"IF($K$1=1,D77,G77)","v":"bath"},null,{"$f":"IF($K$1=1,IF(E77=\"\",\"\",E77),IF(H77=\"\",\"\",H77))","v":""},{"$f":"IF($K$1=1,G77,D77)","v":"das Bad"}]
[null,"08-V. Pres. 1",{"$f":"IF(AND(LEFT(D78,1)=\"d\",MID(D78,4,1)=\" \"),RIGHT(D78,LEN(D78)-4),D78)","v":"schwimmen"},"schwimmen",null,0,"to swim",null,0,{"$f":"RAND()","v":0.5850271221518084},{"$f":"IF(Table24[[#This Row],[Type Here]]=\"\",\"\",IF(Table24[[#This Row],[Type Here]]=Table24[[#This Row],[Answer]],1,-2))","v":""},{"$f":"IF($K$1=1,Table24[[#This Row],[Strength1]],Table24[[#This Row],[Strength2]])","v":0},{"$f":"IF($K$1=1,D78,G78)","v":"to swim"},null,{"$f":"IF($K$1=1,IF(E78=\"\",\"\",E78),IF(H78=\"\",\"\",H78))","v":""},{"$f":"IF($K$1=1,G78,D78)","v":"schwimmen"}]
[null,"06-Plurals",{"$f":"IF(AND(LEFT(D79,1)=\"d\",MID(D79,4,1)=\" \"),RIGHT(D79,LEN(D79)-4),D79)","v":"Eier"},"die Eier",null,0,"eggs",null,2,{"$f":"RAND()","v":0.5151332341701563},{"$f":"IF(Table24[[#This Row],[Type Here]]=\"\",\"\",IF(Table24[[#This Row],[Type Here]]=Table24[[#This Row],[Answer]],1,-2))","v":""},{"$f":"IF($K$1=1,Table24[[#This Row],[Strength1]],Table24[[#This Row],[Strength2]])","v":2},{"$f":"IF($K$1=1,D79,G79)","v":"eggs"},null,{"$f":"IF($K$1=1,IF(E79=\"\",\"\",E79),IF(H79=\"\",\"\",H79))","v":""},{"$f":"IF($K$1=1,G79,D79)","v":"die Eier"}]
[null,"08-V. Pres. 1",{"$f":"IF(AND(LEFT(D80,1)=\"d\",MID(D80,4,1)=\" \"),RIGHT(D80,LEN(D80)-4),D80)","v":"lernen"},"lernen",null,0,"to learn",null,0,{"$f":"RAND()","v":0.8550384805743286},{"$f":"IF(Table24[[#This Row],[Type Here]]=\"\",\"\",IF(Table24[[#This Row],[Type Here]]=Table24[[#This Row],[Answer]],1,-2))","v":""},{"$f":"IF($K$1=1,Table24[[#This Row],[Strength1]],Table24[[#This Row],[Strength2]])","v":0},{"$f":"IF($K$1=1,D80,G80)","v":"to learn"},null,{"$f":"IF($K$1=1,IF(E80=\"\",\"\",E80),IF(H80=\"\",\"\",H80))","v":""},{"$f":"IF($K$1=1,G80,D80)","v":"lernen"}]
[null,"12-Acc. Pron.",{"$f":"IF(AND(LEFT(D81,1)=\"d\",MID(D81,4,1)=\" \"),RIGHT(D81,LEN(D81)-4),D81)","v":"alle"},"alle",null,null,"all",null,null,{"$f":"RAND()","v":0.8524413553591307},{"$f":"IF(Table24[[#This Row],[Type Here]]=\"\",\"\",IF(Table24[[#This Row],[Type Here]]=Table24[[#This Row],[Answer]],1,-2))","v":""},{"$f":"IF($K$1=1,Table24[[#This Row],[Strength1]],Table24[[#This Row],[Strength2]])","v":0},{"$f":"IF($K$1=1,D81,G81)","v":"all"},null,{"$f":"IF($K$1=1,IF(E81=\"\",\"\",E81),IF(H81=\"\",\"\",H81))","v":""},{"$f":"IF($K$1=1,G81,D81)","v":"alle"}]
[null,"14-Household",{"$f":"IF(AND(LEFT(D82,1)=\"d\",MID(D82,4,1)=\" \"),RIGHT(D82,LEN(D82)-4),D82)","v":"Bettbezüge"},"die Bettbezüge",null,0,"bedcovers",null,0,{"$f":"RAND()","v":0.8558114920667917},{"$f":"IF(Table24[[#This Row],[Type Here]]=\"\",\"\",IF(Table24[[#This Row],[Type Here]]=Table24[[#This Row],[Answer]],1,-2))","v":""},{"$f":"IF($K$1=1,Table24[[#This Row],[Strength1]],Table24[[#This Row],[Strength2]])","v":0},{"$f":"IF($K$1=1,D82,G82)","v":"bedcovers"},null,{"$f":"IF($K$1=1,IF(E82=\"\",\"\",E82),IF(H82=\"\",\"\",H82))","v":""},{"$f":"IF($K$1=1,G82,D82)","v":"die Bettbezüge"}]
[null,"40-Places",{"$f":"IF(AND(LEFT(D83,1)=\"d\",MID(D83,4,1)=\" \"),RIGHT(D83,LEN(D83)-4),D83)","v":"rechts"},"rechts",null,0,"right","on the right",4,{"$f":"RAND()","v":0.37537290797754463},{"$f":"IF(Table24[[#This Row],[Type Here]]=\"\",\"\",IF(Table24[[#This Row],[Type Here]]=Table24[[#This Row],[Answer]],1,-2))","v":""},{"$f":"IF($K$1=1,Table24[[#This Row],[Strength1]],Table24[[#This Row],[Strength2]])","v":4},{"$f":"IF($K$1=1,D83,G83)","v":"right"},null,{"$f":"IF($K$1=1,IF(E83=\"\",\"\",E83),IF(H83=\"\",\"\",H83))","v":"on the right"},{"$f":"IF($K$1=1,G83,D83)","v":"rechts"}]
[null,"36-Nature",{"$f":"IF(AND(LEFT(D84,1)=\"d\",MID(D84,4,1)=\" \"),RIGHT(D84,LEN(D84)-4),D84)","v":"Feuer"},"die Feuer",null,0,"fires",null,6,{"$f":"RAND()","v":0.40749037033283086},{"$f":"IF(Table24[[#This Row],[Type Here]]=\"\",\"\",IF(Table24[[#This Row],[Type Here]]=Table24[[#This Row],[Answer]],1,-2))","v":""},{"$f":"IF($K$1=1,Table24[[#This Row],[Strength1]],Table24[[#This Row],[Strength2]])","v":6},{"$f":"IF($K$1=1,D84,G84)","v":"fires"},null,{"$f":"IF($K$1=1,IF(E84=\"\",\"\",E84),IF(H84=\"\",\"\",H84))","v":""},{"$f":"IF($K$1=1,G84,D84)","v":"die Feuer"}]
[null,"29-Medical",{"$f":"IF(AND(LEFT(D85,1)=\"d\",MID(D85,4,1)=\" \"),RIGHT(D85,LEN(D85)-4),D85)","v":"Körper"},"die Körper",null,0,"bodies","anatomy",3,{"$f":"RAND()","v":0.08440393450728767},{"$f":"IF(Table24[[#This Row],[Type Here]]=\"\",\"\",IF(Table24[[#This Row],[Type Here]]=Table24[[#This Row],[Answer]],1,-2))","v":""},{"$f":"IF($K$1=1,Table24[[#This Row],[Strength1]],Table24[[#This Row],[Strength2]])","v":3},{"$f":"IF($K$1=1,D85,G85)","v":"bodies"},null,{"$f":"IF($K$1=1,IF(E85=\"\",\"\",E85),IF(H85=\"\",\"\",H85))","v":"anatomy"},{"$f":"IF($K$1=1,G85,D85)","v":"die Körper"}]
[null,"38-Ad: Nom. 1",{"$f":"IF(AND(LEFT(D86,1)=\"d\",MID(D86,4,1)=\" \"),RIGHT(D86,LEN(D86)-4),D86)","v":"hohen Baum"},"hohen Baum",null,0,"high tree","Accusative",3,{"$f":"RAND()","v":0.6242335273130798},{"$f":"IF(Table24[[#This Row],[Type Here]]=\"\",\"\",IF(Table24[[#This Row],[Type Here]]=Table24[[#This Row],[Answer]],1,-2))","v":""},{"$f":"IF($K$1=1,Table24[[#This Row],[Strength1]],Table24[[#This Row],[Strength2]])","v":3},{"$f":"IF($K$1=1,D86,G86)","v":"high tree"},null,{"$f":"IF($K$1=1,IF(E86=\"\",\"\",E86),IF(H86=\"\",\"\",H86))","v":"Accusative"},{"$f":"IF($K$1=1,G86,D86)","v":"hohen Baum"}]
[null,"38-Ad: Nom. 1",{"$f":"IF(AND(LEFT(D87,1)=\"d\",MID(D87,4,1)=\" \"),RIGHT(D87,LEN(D87)-4),D87)","v":"passend"},"passend",null,0,"suitable","(appropriate)",3,{"$f":"RAND()","v":0.3208493709270318},{"$f":"IF(Table24[[#This Row],[Type Here]]=\"\",\"\",IF(Table24[[#This Row],[Type Here]]=Table24[[#This Row],[Answer]],1,-2))","v":""},{"$f":"IF($K$1=1,Table24[[#This Row],[Strength1]],Table24[[#This Row],[Strength2]])","v":3},{"$f":"IF($K$1=1,D87,G87)","v":"suitable"},null,{"$f":"IF($K$1=1,IF(E87=\"\",\"\",E87),IF(H87=\"\",\"\",H87))","v":"(appropriate)"},{"$f":"IF($K$1=1,G87,D87)","v":"passend"}]
[null,"09-Clothing",{"$f":"IF(AND(LEFT(D88,1)=\"d\",MID(D88,4,1)=\" \"),RIGHT(D88,LEN(D88)-4),D88)","v":"Hemden"},"die Hemden",null,0,"shirts",null,-1,{"$f":"RAND()","v":0.2263476952497373},{"$f":"IF(Table24[[#This Row],[Type Here]]=\"\",\"\",IF(Table24[[#This Row],[Type Here]]=Table24[[#This Row],[Answer]],1,-2))","v":""},{"$f":"IF($K$1=1,Table24[[#This Row],[Strength1]],Table24[[#This Row],[Strength2]])","v":-1},{"$f":"IF($K$1=1,D88,G88)","v":"shirts"},null,{"$f":"IF($K$1=1,IF(E88=\"\",\"\",E88),IF(H88=\"\",\"\",H88))","v":""},{"$f":"IF($K$1=1,G88,D88)","v":"die Hemden"}]
[null,"12-Acc. Pron.",{"$f":"IF(AND(LEFT(D89,1)=\"d\",MID(D89,4,1)=\" \"),RIGHT(D89,LEN(D89)-4),D89)","v":"dich"},"dich",null,null,"you","Acc. (singular familiar)",null,{"$f":"RAND()","v":0.3697957449205853},{"$f":"IF(Table24[[#This Row],[Type Here]]=\"\",\"\",IF(Table24[[#This Row],[Type Here]]=Table24[[#This Row],[Answer]],1,-2))","v":""},{"$f":"IF($K$1=1,Table24[[#This Row],[Strength1]],Table24[[#This Row],[Strength2]])","v":0},{"$f":"IF($K$1=1,D89,G89)","v":"you"},null,{"$f":"IF($K$1=1,IF(E89=\"\",\"\",E89),IF(H89=\"\",\"\",H89))","v":"Acc. (singular familiar)"},{"$f":"IF($K$1=1,G89,D89)","v":"dich"}]
[null,"39-Adj: Acc.",{"$f":"IF(AND(LEFT(D90,1)=\"d\",MID(D90,4,1)=\" \"),RIGHT(D90,LEN(D90)-4),D90)","v":"einzig"},"einzig","adjective",0,"single","(the only one)",9,{"$f":"RAND()","v":0.8123348125326125},{"$f":"IF(Table24[[#This Row],[Type Here]]=\"\",\"\",IF(Table24[[#This Row],[Type Here]]=Table24[[#This Row],[Answer]],1,-2))","v":""},{"$f":"IF($K$1=1,Table24[[#This Row],[Strength1]],Table24[[#This Row],[Strength2]])","v":9},{"$f":"IF($K$1=1,D90,G90)","v":"single"},null,{"$f":"IF($K$1=1,IF(E90=\"\",\"\",E90),IF(H90=\"\",\"\",H90))","v":"(the only one)"},{"$f":"IF($K$1=1,G90,D90)","v":"einzig"}]
[null,"01-Basics 1",{"$f":"IF(AND(LEFT(D91,1)=\"d\",MID(D91,4,1)=\" \"),RIGHT(D91,LEN(D91)-4),D91)","v":"du trinkst"},"du trinkst",null,0,"you drink","(singular familiar)",2,{"$f":"RAND()","v":0.45948905170361576},{"$f":"IF(Table24[[#This Row],[Type Here]]=\"\",\"\",IF(Table24[[#This Row],[Type Here]]=Table24[[#This Row],[Answer]],1,-2))","v":""},{"$f":"IF($K$1=1,Table24[[#This Row],[Strength1]],Table24[[#This Row],[Strength2]])","v":2},{"$f":"IF($K$1=1,D91,G91)","v":"you drink"},null,{"$f":"IF($K$1=1,IF(E91=\"\",\"\",E91),IF(H91=\"\",\"\",H91))","v":"(singular familiar)"},{"$f":"IF($K$1=1,G91,D91)","v":"du trinkst"}]
[null,"10-Nom. Pron.",{"$f":"IF(AND(LEFT(D92,1)=\"d\",MID(D92,4,1)=\" \"),RIGHT(D92,LEN(D92)-4),D92)","v":"das"},"das","(pronoun)",0,"that","(pronoun)",1,{"$f":"RAND()","v":0.17488411822955097},{"$f":"IF(Table24[[#This Row],[Type Here]]=\"\",\"\",IF(Table24[[#This Row],[Type Here]]=Table24[[#This Row],[Answer]],1,-2))","v":""},{"$f":"IF($K$1=1,Table24[[#This Row],[Strength1]],Table24[[#This Row],[Strength2]])","v":1},{"$f":"IF($K$1=1,D92,G92)","v":"that"},null,{"$f":"IF($K$1=1,IF(E92=\"\",\"\",E92),IF(H92=\"\",\"\",H92))","v":"(pronoun)"},{"$f":"IF($K$1=1,G92,D92)","v":"das"}]
[null,"04-Food",{"$f":"IF(AND(LEFT(D93,1)=\"d\",MID(D93,4,1)=\" \"),RIGHT(D93,LEN(D93)-4),D93)","v":"Zucker"},"der Zucker",null,0,"sugar",null,4,{"$f":"RAND()","v":0.6619558253206969},{"$f":"IF(Table24[[#This Row],[Type Here]]=\"\",\"\",IF(Table24[[#This Row],[Type Here]]=Table24[[#This Row],[Answer]],1,-2))","v":""},{"$f":"IF($K$1=1,Table24[[#This Row],[Strength1]],Table24[[#This Row],[Strength2]])","v":4},{"$f":"IF($K$1=1,D93,G93)","v":"sugar"},null,{"$f":"IF($K$1=1,IF(E93=\"\",\"\",E93),IF(H93=\"\",\"\",H93))","v":""},{"$f":"IF($K$1=1,G93,D93)","v":"der Zucker"}]
[null,"33-Adverbs 1",{"$f":"IF(AND(LEFT(D94,1)=\"d\",MID(D94,4,1)=\" \"),RIGHT(D94,LEN(D94)-4),D94)","v":"oben"},"oben","(in a house)",0,"upstairs",null,0,{"$f":"RAND()","v":0.16999305706924517},{"$f":"IF(Table24[[#This Row],[Type Here]]=\"\",\"\",IF(Table24[[#This Row],[Type Here]]=Table24[[#This Row],[Answer]],1,-2))","v":""},{"$f":"IF($K$1=1,Table24[[#This Row],[Strength1]],Table24[[#This Row],[Strength2]])","v":0},{"$f":"IF($K$1=1,D94,G94)","v":"upstairs"},null,{"$f":"IF($K$1=1,IF(E94=\"\",\"\",E94),IF(H94=\"\",\"\",H94))","v":""},{"$f":"IF($K$1=1,G94,D94)","v":"oben"}]
[null,"07-Adjectives",{"$f":"IF(AND(LEFT(D95,1)=\"d\",MID(D95,4,1)=\" \"),RIGHT(D95,LEN(D95)-4),D95)","v":"wahrscheinlich"},"wahrscheinlich",null,0,"likely",null,0,{"$f":"RAND()","v":0.469092454774123},{"$f":"IF(Table24[[#This Row],[Type Here]]=\"\",\"\",IF(Table24[[#This Row],[Type Here]]=Table24[[#This Row],[Answer]],1,-2))","v":""},{"$f":"IF($K$1=1,Table24[[#This Row],[Strength1]],Table24[[#This Row],[Strength2]])","v":0},{"$f":"IF($K$1=1,D95,G95)","v":"likely"},null,{"$f":"IF($K$1=1,IF(E95=\"\",\"\",E95),IF(H95=\"\",\"\",H95))","v":""},{"$f":"IF($K$1=1,G95,D95)","v":"wahrscheinlich"}]
[null,"07-Adjectives",{"$f":"IF(AND(LEFT(D96,1)=\"d\",MID(D96,4,1)=\" \"),RIGHT(D96,LEN(D96)-4),D96)","v":"möglich"},"möglich",null,0,"possible",null,0,{"$f":"RAND()","v":0.9355474640880441},{"$f":"IF(Table24[[#This Row],[Type Here]]=\"\",\"\",IF(Table24[[#This Row],[Type Here]]=Table24[[#This Row],[Answer]],1,-2))","v":""},{"$f":"IF($K$1=1,Table24[[#This Row],[Strength1]],Table24[[#This Row],[Strength2]])","v":0},{"$f":"IF($K$1=1,D96,G96)","v":"possible"},null,{"$f":"IF($K$1=1,IF(E96=\"\",\"\",E96),IF(H96=\"\",\"\",H96))","v":""},{"$f":"IF($K$1=1,G96,D96)","v":"möglich"}]
[null,"40-Places",{"$f":"IF(AND(LEFT(D97,1)=\"d\",MID(D97,4,1)=\" \"),RIGHT(D97,LEN(D97)-4),D97)","v":"Gebäude"},"das Gebäude",null,0,"building","(ediface)",-2,{"$f":"RAND()","v":0.21825015668717185},{"$f":"IF(Table24[[#This Row],[Type Here]]=\"\",\"\",IF(Table24[[#This Row],[Type Here]]=Table24[[#This Row],[Answer]],1,-2))","v":""},{"$f":"IF($K$1=1,Table24[[#This Row],[Strength1]],Table24[[#This Row],[Strength2]])","v":-2},{"$f":"IF($K$1=1,D97,G97)","v":"building"},null,{"$f":"IF($K$1=1,IF(E97=\"\",\"\",E97),IF(H97=\"\",\"\",H97))","v":"(ediface)"},{"$f":"IF($K$1=1,G97,D97)","v":"das Gebäude"}]
[null,"40-Places",{"$f":"IF(AND(LEFT(D98,1)=\"d\",MID(D98,4,1)=\" \"),RIGHT(D98,LEN(D98)-4),D98)","v":"Stationen"},"die Stationen",null,0,"stations","(general)",1,{"$f":"RAND()","v":0.9315751770499523},{"$f":"IF(Table24[[#This Row],[Type Here]]=\"\",\"\",IF(Table24[[#This Row],[Type Here]]=Table24[[#This Row],[Answer]],1,-2))","v":""},{"$f":"IF($K$1=1,Table24[[#This Row],[Strength1]],Table24[[#This Row],[Strength2]])","v":1},{"$f":"IF($K$1=1,D98,G98)","v":"stations"},null,{"$f":"IF($K$1=1,IF(E98=\"\",\"\",E98),IF(H98=\"\",\"\",H98))","v":"(general)"},{"$f":"IF($K$1=1,G98,D98)","v":"die Stationen"}]
[null,"14-Household",{"$f":"IF(AND(LEFT(D99,1)=\"d\",MID(D99,4,1)=\" \"),RIGHT(D99,LEN(D99)-4),D99)","v":"Schlafzimmer"},"das Schlafzimmer",null,0,"bedroom",null,1,{"$f":"RAND()","v":0.46595035709838917},{"$f":"IF(Table24[[#This Row],[Type Here]]=\"\",\"\",IF(Table24[[#This Row],[Type Here]]=Table24[[#This Row],[Answer]],1,-2))","v":""},{"$f":"IF($K$1=1,Table24[[#This Row],[Strength1]],Table24[[#This Row],[Strength2]])","v":1},{"$f":"IF($K$1=1,D99,G99)","v":"bedroom"},null,{"$f":"IF($K$1=1,IF(E99=\"\",\"\",E99),IF(H99=\"\",\"\",H99))","v":""},{"$f":"IF($K$1=1,G99,D99)","v":"das Schlafzimmer"}]
[null,"14-Household",{"$f":"IF(AND(LEFT(D100,1)=\"d\",MID(D100,4,1)=\" \"),RIGHT(D100,LEN(D100)-4),D100)","v":"Wohnung"},"die Wohnung",null,0,"dwelling",null,1,{"$f":"RAND()","v":0.06999990332630723},{"$f":"IF(Table24[[#This Row],[Type Here]]=\"\",\"\",IF(Table24[[#This Row],[Type Here]]=Table24[[#This Row],[Answer]],1,-2))","v":""},{"$f":"IF($K$1=1,Table24[[#This Row],[Strength1]],Table24[[#This Row],[Strength2]])","v":1},{"$f":"IF($K$1=1,D100,G100)","v":"dwelling"},null,{"$f":"IF($K$1=1,IF(E100=\"\",\"\",E100),IF(H100=\"\",\"\",H100))","v":""},{"$f":"IF($K$1=1,G100,D100)","v":"die Wohnung"}]
[null,"29-Medical",{"$f":"IF(AND(LEFT(D101,1)=\"d\",MID(D101,4,1)=\" \"),RIGHT(D101,LEN(D101)-4),D101)","v":"Beine"},"die Beine",null,0,"legs",null,4,{"$f":"RAND()","v":0.9410563857106173},{"$f":"IF(Table24[[#This Row],[Type Here]]=\"\",\"\",IF(Table24[[#This Row],[Type Here]]=Table24[[#This Row],[Answer]],1,-2))","v":""},{"$f":"IF($K$1=1,Table24[[#This Row],[Strength1]],Table24[[#This Row],[Strength2]])","v":4},{"$f":"IF($K$1=1,D101,G101)","v":"legs"},null,{"$f":"IF($K$1=1,IF(E101=\"\",\"\",E101),IF(H101=\"\",\"\",H101))","v":""},{"$f":"IF($K$1=1,G101,D101)","v":"die Beine"}]
[null,"33-Adverbs 1",{"$f":"IF(AND(LEFT(D102,1)=\"d\",MID(D102,4,1)=\" \"),RIGHT(D102,LEN(D102)-4),D102)","v":"bereits"},"bereits",null,0,"already","(more formal, written, seldom oral)",0,{"$f":"RAND()","v":0.4075051588479147},{"$f":"IF(Table24[[#This Row],[Type Here]]=\"\",\"\",IF(Table24[[#This Row],[Type Here]]=Table24[[#This Row],[Answer]],1,-2))","v":""},{"$f":"IF($K$1=1,Table24[[#This Row],[Strength1]],Table24[[#This Row],[Strength2]])","v":0},{"$f":"IF($K$1=1,D102,G102)","v":"already"},null,{"$f":"IF($K$1=1,IF(E102=\"\",\"\",E102),IF(H102=\"\",\"\",H102))","v":"(more formal, written, seldom oral)"},{"$f":"IF($K$1=1,G102,D102)","v":"bereits"}]
[null,"02-Basics 2",{"$f":"IF(AND(LEFT(D103,1)=\"d\",MID(D103,4,1)=\" \"),RIGHT(D103,LEN(D103)-4),D103)","v":"die"},"die","(article - Nom plural)",0,"the","Nom plural",0,{"$f":"RAND()","v":0.5755694407907248},{"$f":"IF(Table24[[#This Row],[Type Here]]=\"\",\"\",IF(Table24[[#This Row],[Type Here]]=Table24[[#This Row],[Answer]],1,-2))","v":""},{"$f":"IF($K$1=1,Table24[[#This Row],[Strength1]],Table24[[#This Row],[Strength2]])","v":0},{"$f":"IF($K$1=1,D103,G103)","v":"the"},null,{"$f":"IF($K$1=1,IF(E103=\"\",\"\",E103),IF(H103=\"\",\"\",H103))","v":"Nom plural"},{"$f":"IF($K$1=1,G103,D103)","v":"die"}]
[null,"29-Medical",{"$f":"IF(AND(LEFT(D104,1)=\"d\",MID(D104,4,1)=\" \"),RIGHT(D104,LEN(D104)-4),D104)","v":"Kliniken"},"die Kliniken",null,0,"clinics",null,0,{"$f":"RAND()","v":0.7611943231972088},{"$f":"IF(Table24[[#This Row],[Type Here]]=\"\",\"\",IF(Table24[[#This Row],[Type Here]]=Table24[[#This Row],[Answer]],1,-2))","v":""},{"$f":"IF($K$1=1,Table24[[#This Row],[Strength1]],Table24[[#This Row],[Strength2]])","v":0},{"$f":"IF($K$1=1,D104,G104)","v":"clinics"},null,{"$f":"IF($K$1=1,IF(E104=\"\",\"\",E104),IF(H104=\"\",\"\",H104))","v":""},{"$f":"IF($K$1=1,G104,D104)","v":"die Kliniken"}]
[null,"14-Household",{"$f":"IF(AND(LEFT(D105,1)=\"d\",MID(D105,4,1)=\" \"),RIGHT(D105,LEN(D105)-4),D105)","v":"Tassen"},"die Tassen",null,0,"cups",null,1,{"$f":"RAND()","v":0.5061308125189867},{"$f":"IF(Table24[[#This Row],[Type Here]]=\"\",\"\",IF(Table24[[#This Row],[Type Here]]=Table24[[#This Row],[Answer]],1,-2))","v":""},{"$f":"IF($K$1=1,Table24[[#This Row],[Strength1]],Table24[[#This Row],[Strength2]])","v":1},{"$f":"IF($K$1=1,D105,G105)","v":"cups"},null,{"$f":"IF($K$1=1,IF(E105=\"\",\"\",E105),IF(H105=\"\",\"\",H105))","v":""},{"$f":"IF($K$1=1,G105,D105)","v":"die Tassen"}]
[null,"04-Food",{"$f":"IF(AND(LEFT(D106,1)=\"d\",MID(D106,4,1)=\" \"),RIGHT(D106,LEN(D106)-4),D106)","v":"Essen"},"das Essen",null,0,"meal",null,3,{"$f":"RAND()","v":0.45060728349490786},{"$f":"IF(Table24[[#This Row],[Type Here]]=\"\",\"\",IF(Table24[[#This Row],[Type Here]]=Table24[[#This Row],[Answer]],1,-2))","v":""},{"$f":"IF($K$1=1,Table24[[#This Row],[Strength1]],Table24[[#This Row],[Strength2]])","v":3},{"$f":"IF($K$1=1,D106,G106)","v":"meal"},null,{"$f":"IF($K$1=1,IF(E106=\"\",\"\",E106),IF(H106=\"\",\"\",H106))","v":""},{"$f":"IF($K$1=1,G106,D106)","v":"das Essen"}]
[null,"01-Basics 1",{"$f":"IF(AND(LEFT(D107,1)=\"d\",MID(D107,4,1)=\" \"),RIGHT(D107,LEN(D107)-4),D107)","v":"Milch"},"das Milch","no plural form?",0,"milk","(noun)",1,{"$f":"RAND()","v":0.31251334233597505},{"$f":"IF(Table24[[#This Row],[Type Here]]=\"\",\"\",IF(Table24[[#This Row],[Type Here]]=Table24[[#This Row],[Answer]],1,-2))","v":""},{"$f":"IF($K$1=1,Table24[[#This Row],[Strength1]],Table24[[#This Row],[Strength2]])","v":1},{"$f":"IF($K$1=1,D107,G107)","v":"milk"},null,{"$f":"IF($K$1=1,IF(E107=\"\",\"\",E107),IF(H107=\"\",\"\",H107))","v":"(noun)"},{"$f":"IF($K$1=1,G107,D107)","v":"das Milch"}]
[null,"33-Adverbs 1",{"$f":"IF(AND(LEFT(D108,1)=\"d\",MID(D108,4,1)=\" \"),RIGHT(D108,LEN(D108)-4),D108)","v":"darüber"},"darüber",null,0,"about that",null,0,{"$f":"RAND()","v":0.022368843773797442},{"$f":"IF(Table24[[#This Row],[Type Here]]=\"\",\"\",IF(Table24[[#This Row],[Type Here]]=Table24[[#This Row],[Answer]],1,-2))","v":""},{"$f":"IF($K$1=1,Table24[[#This Row],[Strength1]],Table24[[#This Row],[Strength2]])","v":0},{"$f":"IF($K$1=1,D108,G108)","v":"about that"},null,{"$f":"IF($K$1=1,IF(E108=\"\",\"\",E108),IF(H108=\"\",\"\",H108))","v":""},{"$f":"IF($K$1=1,G108,D108)","v":"darüber"}]
[null,"36-Nature",{"$f":"IF(AND(LEFT(D109,1)=\"d\",MID(D109,4,1)=\" \"),RIGHT(D109,LEN(D109)-4),D109)","v":"Berg"},"der Berg",null,0,"mountain",null,6,{"$f":"RAND()","v":0.1576758751360896},{"$f":"IF(Table24[[#This Row],[Type Here]]=\"\",\"\",IF(Table24[[#This Row],[Type Here]]=Table24[[#This Row],[Answer]],1,-2))","v":""},{"$f":"IF($K$1=1,Table24[[#This Row],[Strength1]],Table24[[#This Row],[Strength2]])","v":6},{"$f":"IF($K$1=1,D109,G109)","v":"mountain"},null,{"$f":"IF($K$1=1,IF(E109=\"\",\"\",E109),IF(H109=\"\",\"\",H109))","v":""},{"$f":"IF($K$1=1,G109,D109)","v":"der Berg"}]
[null,"40-Places",{"$f":"IF(AND(LEFT(D110,1)=\"d\",MID(D110,4,1)=\" \"),RIGHT(D110,LEN(D110)-4),D110)","v":"Plätze"},"die Plätze",null,0,"places","(spaces, seats, localities)",0,{"$f":"RAND()","v":0.9481347045027438},{"$f":"IF(Table24[[#This Row],[Type Here]]=\"\",\"\",IF(Table24[[#This Row],[Type Here]]=Table24[[#This Row],[Answer]],1,-2))","v":""},{"$f":"IF($K$1=1,Table24[[#This Row],[Strength1]],Table24[[#This Row],[Strength2]])","v":0},{"$f":"IF($K$1=1,D110,G110)","v":"places"},null,{"$f":"IF($K$1=1,IF(E110=\"\",\"\",E110),IF(H110=\"\",\"\",H110))","v":"(spaces, seats, localities)"},{"$f":"IF($K$1=1,G110,D110)","v":"die Plätze"}]
[null,"29-Medical",{"$f":"IF(AND(LEFT(D111,1)=\"d\",MID(D111,4,1)=\" \"),RIGHT(D111,LEN(D111)-4),D111)","v":"Alkohole"},"die Alkohole",null,0,"alcohols",null,3,{"$f":"RAND()","v":0.09671518691970804},{"$f":"IF(Table24[[#This Row],[Type Here]]=\"\",\"\",IF(Table24[[#This Row],[Type Here]]=Table24[[#This Row],[Answer]],1,-2))","v":""},{"$f":"IF($K$1=1,Table24[[#This Row],[Strength1]],Table24[[#This Row],[Strength2]])","v":3},{"$f":"IF($K$1=1,D111,G111)","v":"alcohols"},null,{"$f":"IF($K$1=1,IF(E111=\"\",\"\",E111),IF(H111=\"\",\"\",H111))","v":""},{"$f":"IF($K$1=1,G111,D111)","v":"die Alkohole"}]
[null,"14-Household",{"$f":"IF(AND(LEFT(D112,1)=\"d\",MID(D112,4,1)=\" \"),RIGHT(D112,LEN(D112)-4),D112)","v":"Wand"},"die Wand",null,0,"wall",null,0,{"$f":"RAND()","v":0.3451945124862067},{"$f":"IF(Table24[[#This Row],[Type Here]]=\"\",\"\",IF(Table24[[#This Row],[Type Here]]=Table24[[#This Row],[Answer]],1,-2))","v":""},{"$f":"IF($K$1=1,Table24[[#This Row],[Strength1]],Table24[[#This Row],[Strength2]])","v":0},{"$f":"IF($K$1=1,D112,G112)","v":"wall"},null,{"$f":"IF($K$1=1,IF(E112=\"\",\"\",E112),IF(H112=\"\",\"\",H112))","v":""},{"$f":"IF($K$1=1,G112,D112)","v":"die Wand"}]
[null,"39-Adj: Acc.",{"$f":"IF(AND(LEFT(D113,1)=\"d\",MID(D113,4,1)=\" \"),RIGHT(D113,LEN(D113)-4),D113)","v":"verschieden"},"verschieden",null,0,"different","(separate)",2,{"$f":"RAND()","v":0.5135380340465895},{"$f":"IF(Table24[[#This Row],[Type Here]]=\"\",\"\",IF(Table24[[#This Row],[Type Here]]=Table24[[#This Row],[Answer]],1,-2))","v":""},{"$f":"IF($K$1=1,Table24[[#This Row],[Strength1]],Table24[[#This Row],[Strength2]])","v":2},{"$f":"IF($K$1=1,D113,G113)","v":"different"},null,{"$f":"IF($K$1=1,IF(E113=\"\",\"\",E113),IF(H113=\"\",\"\",H113))","v":"(separate)"},{"$f":"IF($K$1=1,G113,D113)","v":"verschieden"}]
[null,"08-V. Pres. 1",{"$f":"IF(AND(LEFT(D114,1)=\"d\",MID(D114,4,1)=\" \"),RIGHT(D114,LEN(D114)-4),D114)","v":"bringen"},"bringen",null,0,"to bring",null,0,{"$f":"RAND()","v":0.12063275493388992},{"$f":"IF(Table24[[#This Row],[Type Here]]=\"\",\"\",IF(Table24[[#This Row],[Type Here]]=Table24[[#This Row],[Answer]],1,-2))","v":""},{"$f":"IF($K$1=1,Table24[[#This Row],[Strength1]],Table24[[#This Row],[Strength2]])","v":0},{"$f":"IF($K$1=1,D114,G114)","v":"to bring"},null,{"$f":"IF($K$1=1,IF(E114=\"\",\"\",E114),IF(H114=\"\",\"\",H114))","v":""},{"$f":"IF($K$1=1,G114,D114)","v":"bringen"}]
[null,"36-Nature",{"$f":"IF(AND(LEFT(D115,1)=\"d\",MID(D115,4,1)=\" \"),RIGHT(D115,LEN(D115)-4),D115)","v":"Monde"},"die Monde",null,0,"moons",null,6,{"$f":"RAND()","v":0.5929289865058658},{"$f":"IF(Table24[[#This Row],[Type Here]]=\"\",\"\",IF(Table24[[#This Row],[Type Here]]=Table24[[#This Row],[Answer]],1,-2))","v":""},{"$f":"IF($K$1=1,Table24[[#This Row],[Strength1]],Table24[[#This Row],[Strength2]])","v":6},{"$f":"IF($K$1=1,D115,G115)","v":"moons"},null,{"$f":"IF($K$1=1,IF(E115=\"\",\"\",E115),IF(H115=\"\",\"\",H115))","v":""},{"$f":"IF($K$1=1,G115,D115)","v":"die Monde"}]
[null,"04-Food",{"$f":"IF(AND(LEFT(D116,1)=\"d\",MID(D116,4,1)=\" \"),RIGHT(D116,LEN(D116)-4),D116)","v":"Essen"},"die Essen",null,0,"meals",null,1,{"$f":"RAND()","v":0.41998150455744365},{"$f":"IF(Table24[[#This Row],[Type Here]]=\"\",\"\",IF(Table24[[#This Row],[Type Here]]=Table24[[#This Row],[Answer]],1,-2))","v":""},{"$f":"IF($K$1=1,Table24[[#This Row],[Strength1]],Table24[[#This Row],[Strength2]])","v":1},{"$f":"IF($K$1=1,D116,G116)","v":"meals"},null,{"$f":"IF($K$1=1,IF(E116=\"\",\"\",E116),IF(H116=\"\",\"\",H116))","v":""},{"$f":"IF($K$1=1,G116,D116)","v":"die Essen"}]
[null,"40-Places",{"$f":"IF(AND(LEFT(D117,1)=\"d\",MID(D117,4,1)=\" \"),RIGHT(D117,LEN(D117)-4),D117)","v":"links"},"links",null,0,"left","(left side of)",4,{"$f":"RAND()","v":0.7029876820347172},{"$f":"IF(Table24[[#This Row],[Type Here]]=\"\",\"\",IF(Table24[[#This Row],[Type Here]]=Table24[[#This Row],[Answer]],1,-2))","v":""},{"$f":"IF($K$1=1,Table24[[#This Row],[Strength1]],Table24[[#This Row],[Strength2]])","v":4},{"$f":"IF($K$1=1,D117,G117)","v":"left"},null,{"$f":"IF($K$1=1,IF(E117=\"\",\"\",E117),IF(H117=\"\",\"\",H117))","v":"(left side of)"},{"$f":"IF($K$1=1,G117,D117)","v":"links"}]
[null,"40-Places",{"$f":"IF(AND(LEFT(D118,1)=\"d\",MID(D118,4,1)=\" \"),RIGHT(D118,LEN(D118)-4),D118)","v":"Halle"},"die Halle",null,0,"hall",null,2,{"$f":"RAND()","v":0.7733947739716525},{"$f":"IF(Table24[[#This Row],[Type Here]]=\"\",\"\",IF(Table24[[#This Row],[Type Here]]=Table24[[#This Row],[Answer]],1,-2))","v":""},{"$f":"IF($K$1=1,Table24[[#This Row],[Strength1]],Table24[[#This Row],[Strength2]])","v":2},{"$f":"IF($K$1=1,D118,G118)","v":"hall"},null,{"$f":"IF($K$1=1,IF(E118=\"\",\"\",E118),IF(H118=\"\",\"\",H118))","v":""},{"$f":"IF($K$1=1,G118,D118)","v":"die Halle"}]
[null,"29-Medical",{"$f":"IF(AND(LEFT(D119,1)=\"d\",MID(D119,4,1)=\" \"),RIGHT(D119,LEN(D119)-4),D119)","v":"Untersuchung"},"die Untersuchung",null,0,"test",null,0,{"$f":"RAND()","v":0.7912867641630498},{"$f":"IF(Table24[[#This Row],[Type Here]]=\"\",\"\",IF(Table24[[#This Row],[Type Here]]=Table24[[#This Row],[Answer]],1,-2))","v":""},{"$f":"IF($K$1=1,Table24[[#This Row],[Strength1]],Table24[[#This Row],[Strength2]])","v":0},{"$f":"IF($K$1=1,D119,G119)","v":"test"},null,{"$f":"IF($K$1=1,IF(E119=\"\",\"\",E119),IF(H119=\"\",\"\",H119))","v":""},{"$f":"IF($K$1=1,G119,D119)","v":"die Untersuchung"}]
[null,"14-Household",{"$f":"IF(AND(LEFT(D120,1)=\"d\",MID(D120,4,1)=\" \"),RIGHT(D120,LEN(D120)-4),D120)","v":"Schlüssel"},"die Schlüssel",null,0,"keys",null,0,{"$f":"RAND()","v":0.02372017506310975},{"$f":"IF(Table24[[#This Row],[Type Here]]=\"\",\"\",IF(Table24[[#This Row],[Type Here]]=Table24[[#This Row],[Answer]],1,-2))","v":""},{"$f":"IF($K$1=1,Table24[[#This Row],[Strength1]],Table24[[#This Row],[Strength2]])","v":0},{"$f":"IF($K$1=1,D120,G120)","v":"keys"},null,{"$f":"IF($K$1=1,IF(E120=\"\",\"\",E120),IF(H120=\"\",\"\",H120))","v":""},{"$f":"IF($K$1=1,G120,D120)","v":"die Schlüssel"}]
[null,"36-Nature",{"$f":"IF(AND(LEFT(D121,1)=\"d\",MID(D121,4,1)=\" \"),RIGHT(D121,LEN(D121)-4),D121)","v":"Blume"},"die Blume",null,0,"flower",null,6,{"$f":"RAND()","v":0.7186107461811929},{"$f":"IF(Table24[[#This Row],[Type Here]]=\"\",\"\",IF(Table24[[#This Row],[Type Here]]=Table24[[#This Row],[Answer]],1,-2))","v":""},{"$f":"IF($K$1=1,Table24[[#This Row],[Strength1]],Table24[[#This Row],[Strength2]])","v":6},{"$f":"IF($K$1=1,D121,G121)","v":"flower"},null,{"$f":"IF($K$1=1,IF(E121=\"\",\"\",E121),IF(H121=\"\",\"\",H121))","v":""},{"$f":"IF($K$1=1,G121,D121)","v":"die Blume"}]
[null,"14-Household",{"$f":"IF(AND(LEFT(D122,1)=\"d\",MID(D122,4,1)=\" \"),RIGHT(D122,LEN(D122)-4),D122)","v":"Schlaf"},"der Schlaf",null,0,"sleep","noun",2,{"$f":"RAND()","v":0.13299104926570915},{"$f":"IF(Table24[[#This Row],[Type Here]]=\"\",\"\",IF(Table24[[#This Row],[Type Here]]=Table24[[#This Row],[Answer]],1,-2))","v":""},{"$f":"IF($K$1=1,Table24[[#This Row],[Strength1]],Table24[[#This Row],[Strength2]])","v":2},{"$f":"IF($K$1=1,D122,G122)","v":"sleep"},null,{"$f":"IF($K$1=1,IF(E122=\"\",\"\",E122),IF(H122=\"\",\"\",H122))","v":"noun"},{"$f":"IF($K$1=1,G122,D122)","v":"der Schlaf"}]
[null,"07-Adjectives",{"$f":"IF(AND(LEFT(D123,1)=\"d\",MID(D123,4,1)=\" \"),RIGHT(D123,LEN(D123)-4),D123)","v":"interessant"},"interessant",null,0,"interesting",null,3,{"$f":"RAND()","v":0.24792918678596865},{"$f":"IF(Table24[[#This Row],[Type Here]]=\"\",\"\",IF(Table24[[#This Row],[Type Here]]=Table24[[#This Row],[Answer]],1,-2))","v":""},{"$f":"IF($K$1=1,Table24[[#This Row],[Strength1]],Table24[[#This Row],[Strength2]])","v":3},{"$f":"IF($K$1=1,D123,G123)","v":"interesting"},null,{"$f":"IF($K$1=1,IF(E123=\"\",\"\",E123),IF(H123=\"\",\"\",H123))","v":""},{"$f":"IF($K$1=1,G123,D123)","v":"interessant"}]
[null,"05-Animals",{"$f":"IF(AND(LEFT(D124,1)=\"d\",MID(D124,4,1)=\" \"),RIGHT(D124,LEN(D124)-4),D124)","v":"Tier"},"das Tier",null,0,"animal",null,1,{"$f":"RAND()","v":0.592408250367233},{"$f":"IF(Table24[[#This Row],[Type Here]]=\"\",\"\",IF(Table24[[#This Row],[Type Here]]=Table24[[#This Row],[Answer]],1,-2))","v":""},{"$f":"IF($K$1=1,Table24[[#This Row],[Strength1]],Table24[[#This Row],[Strength2]])","v":1},{"$f":"IF($K$1=1,D124,G124)","v":"animal"},null,{"$f":"IF($K$1=1,IF(E124=\"\",\"\",E124),IF(H124=\"\",\"\",H124))","v":""},{"$f":"IF($K$1=1,G124,D124)","v":"das Tier"}]
[null,"33-Adverbs 1",{"$f":"IF(AND(LEFT(D125,1)=\"d\",MID(D125,4,1)=\" \"),RIGHT(D125,LEN(D125)-4),D125)","v":"sonst"},"sonst",null,0,"usually",null,0,{"$f":"RAND()","v":0.1964734075627148},{"$f":"IF(Table24[[#This Row],[Type Here]]=\"\",\"\",IF(Table24[[#This Row],[Type Here]]=Table24[[#This Row],[Answer]],1,-2))","v":""},{"$f":"IF($K$1=1,Table24[[#This Row],[Strength1]],Table24[[#This Row],[Strength2]])","v":0},{"$f":"IF($K$1=1,D125,G125)","v":"usually"},null,{"$f":"IF($K$1=1,IF(E125=\"\",\"\",E125),IF(H125=\"\",\"\",H125))","v":""},{"$f":"IF($K$1=1,G125,D125)","v":"sonst"}]
[null,"05-Animals",{"$f":"IF(AND(LEFT(D126,1)=\"d\",MID(D126,4,1)=\" \"),RIGHT(D126,LEN(D126)-4),D126)","v":"Fliegen"},"die Fliegen",null,0,"flies","(type of insect)",0,{"$f":"RAND()","v":0.7610010745627444},{"$f":"IF(Table24[[#This Row],[Type Here]]=\"\",\"\",IF(Table24[[#This Row],[Type Here]]=Table24[[#This Row],[Answer]],1,-2))","v":""},{"$f":"IF($K$1=1,Table24[[#This Row],[Strength1]],Table24[[#This Row],[Strength2]])","v":0},{"$f":"IF($K$1=1,D126,G126)","v":"flies"},null,{"$f":"IF($K$1=1,IF(E126=\"\",\"\",E126),IF(H126=\"\",\"\",H126))","v":"(type of insect)"},{"$f":"IF($K$1=1,G126,D126)","v":"die Fliegen"}]
[null,"09-Clothing",{"$f":"IF(AND(LEFT(D127,1)=\"d\",MID(D127,4,1)=\" \"),RIGHT(D127,LEN(D127)-4),D127)","v":"Jacken"},"die Jacken",null,0,"jackets",null,-1,{"$f":"RAND()","v":0.7623082847406458},{"$f":"IF(Table24[[#This Row],[Type Here]]=\"\",\"\",IF(Table24[[#This Row],[Type Here]]=Table24[[#This Row],[Answer]],1,-2))","v":""},{"$f":"IF($K$1=1,Table24[[#This Row],[Strength1]],Table24[[#This Row],[Strength2]])","v":-1},{"$f":"IF($K$1=1,D127,G127)","v":"jackets"},null,{"$f":"IF($K$1=1,IF(E127=\"\",\"\",E127),IF(H127=\"\",\"\",H127))","v":""},{"$f":"IF($K$1=1,G127,D127)","v":"die Jacken"}]
[null,"11-Family",{"$f":"IF(AND(LEFT(D128,1)=\"d\",MID(D128,4,1)=\" \"),RIGHT(D128,LEN(D128)-4),D128)","v":"Partner"},"der Partner",null,null,"partner",null,null,{"$f":"RAND()","v":0.7272016541074023},{"$f":"IF(Table24[[#This Row],[Type Here]]=\"\",\"\",IF(Table24[[#This Row],[Type Here]]=Table24[[#This Row],[Answer]],1,-2))","v":""},{"$f":"IF($K$1=1,Table24[[#This Row],[Strength1]],Table24[[#This Row],[Strength2]])","v":0},{"$f":"IF($K$1=1,D128,G128)","v":"partner"},null,{"$f":"IF($K$1=1,IF(E128=\"\",\"\",E128),IF(H128=\"\",\"\",H128))","v":""},{"$f":"IF($K$1=1,G128,D128)","v":"der Partner"}]
[null,"40-Places",{"$f":"IF(AND(LEFT(D129,1)=\"d\",MID(D129,4,1)=\" \"),RIGHT(D129,LEN(D129)-4),D129)","v":"Europa"},"das Europa",null,0,"Europe",null,0,{"$f":"RAND()","v":0.5162393186711366},{"$f":"IF(Table24[[#This Row],[Type Here]]=\"\",\"\",IF(Table24[[#This Row],[Type Here]]=Table24[[#This Row],[Answer]],1,-2))","v":""},{"$f":"IF($K$1=1,Table24[[#This Row],[Strength1]],Table24[[#This Row],[Strength2]])","v":0},{"$f":"IF($K$1=1,D129,G129)","v":"Europe"},null,{"$f":"IF($K$1=1,IF(E129=\"\",\"\",E129),IF(H129=\"\",\"\",H129))","v":""},{"$f":"IF($K$1=1,G129,D129)","v":"das Europa"}]
[null,"01-Basics 1",{"$f":"IF(AND(LEFT(D130,1)=\"d\",MID(D130,4,1)=\" \"),RIGHT(D130,LEN(D130)-4),D130)","v":"ein"},"ein","(article - Acc neut)",0,"a","Acc neut",0,{"$f":"RAND()","v":0.41508920359256385},{"$f":"IF(Table24[[#This Row],[Type Here]]=\"\",\"\",IF(Table24[[#This Row],[Type Here]]=Table24[[#This Row],[Answer]],1,-2))","v":""},{"$f":"IF($K$1=1,Table24[[#This Row],[Strength1]],Table24[[#This Row],[Strength2]])","v":0},{"$f":"IF($K$1=1,D130,G130)","v":"a"},null,{"$f":"IF($K$1=1,IF(E130=\"\",\"\",E130),IF(H130=\"\",\"\",H130))","v":"Acc neut"},{"$f":"IF($K$1=1,G130,D130)","v":"ein"}]
[null,"33-Adverbs 1",{"$f":"IF(AND(LEFT(D131,1)=\"d\",MID(D131,4,1)=\" \"),RIGHT(D131,LEN(D131)-4),D131)","v":"jetzt"},"jetzt",null,0,"now","right now, currently",0,{"$f":"RAND()","v":0.812878501356982},{"$f":"IF(Table24[[#This Row],[Type Here]]=\"\",\"\",IF(Table24[[#This Row],[Type Here]]=Table24[[#This Row],[Answer]],1,-2))","v":""},{"$f":"IF($K$1=1,Table24[[#This Row],[Strength1]],Table24[[#This Row],[Strength2]])","v":0},{"$f":"IF($K$1=1,D131,G131)","v":"now"},null,{"$f":"IF($K$1=1,IF(E131=\"\",\"\",E131),IF(H131=\"\",\"\",H131))","v":"right now, currently"},{"$f":"IF($K$1=1,G131,D131)","v":"jetzt"}]
[null,"38-Ad: Nom. 1",{"$f":"IF(AND(LEFT(D132,1)=\"d\",MID(D132,4,1)=\" \"),RIGHT(D132,LEN(D132)-4),D132)","v":"hohes Dach"},"hohes Dach",null,0,"high roof","Nominative",3,{"$f":"RAND()","v":0.14077279772668982},{"$f":"IF(Table24[[#This Row],[Type Here]]=\"\",\"\",IF(Table24[[#This Row],[Type Here]]=Table24[[#This Row],[Answer]],1,-2))","v":""},{"$f":"IF($K$1=1,Table24[[#This Row],[Strength1]],Table24[[#This Row],[Strength2]])","v":3},{"$f":"IF($K$1=1,D132,G132)","v":"high roof"},null,{"$f":"IF($K$1=1,IF(E132=\"\",\"\",E132),IF(H132=\"\",\"\",H132))","v":"Nominative"},{"$f":"IF($K$1=1,G132,D132)","v":"hohes Dach"}]
[null,"29-Medical",{"$f":"IF(AND(LEFT(D133,1)=\"d\",MID(D133,4,1)=\" \"),RIGHT(D133,LEN(D133)-4),D133)","v":"Krankenwagen"},"der Krankenwagen",null,0,"ambulance",null,3,{"$f":"RAND()","v":0.02576559692070257},{"$f":"IF(Table24[[#This Row],[Type Here]]=\"\",\"\",IF(Table24[[#This Row],[Type Here]]=Table24[[#This Row],[Answer]],1,-2))","v":""},{"$f":"IF($K$1=1,Table24[[#This Row],[Strength1]],Table24[[#This Row],[Strength2]])","v":3},{"$f":"IF($K$1=1,D133,G133)","v":"ambulance"},null,{"$f":"IF($K$1=1,IF(E133=\"\",\"\",E133),IF(H133=\"\",\"\",H133))","v":""},{"$f":"IF($K$1=1,G133,D133)","v":"der Krankenwagen"}]
[null,"14-Household",{"$f":"IF(AND(LEFT(D134,1)=\"d\",MID(D134,4,1)=\" \"),RIGHT(D134,LEN(D134)-4),D134)","v":"Haushalte"},"die Haushalte",null,0,"households",null,-2,{"$f":"RAND()","v":0.5779782600352993},{"$f":"IF(Table24[[#This Row],[Type Here]]=\"\",\"\",IF(Table24[[#This Row],[Type Here]]=Table24[[#This Row],[Answer]],1,-2))","v":""},{"$f":"IF($K$1=1,Table24[[#This Row],[Strength1]],Table24[[#This Row],[Strength2]])","v":-2},{"$f":"IF($K$1=1,D134,G134)","v":"households"},null,{"$f":"IF($K$1=1,IF(E134=\"\",\"\",E134),IF(H134=\"\",\"\",H134))","v":""},{"$f":"IF($K$1=1,G134,D134)","v":"die Haushalte"}]
[null,"33-Adverbs 1",{"$f":"IF(AND(LEFT(D135,1)=\"d\",MID(D135,4,1)=\" \"),RIGHT(D135,LEN(D135)-4),D135)","v":"etwa"},"etwa",null,0,"approximately",null,-1,{"$f":"RAND()","v":0.9531386479285352},{"$f":"IF(Table24[[#This Row],[Type Here]]=\"\",\"\",IF(Table24[[#This Row],[Type Here]]=Table24[[#This Row],[Answer]],1,-2))","v":""},{"$f":"IF($K$1=1,Table24[[#This Row],[Strength1]],Table24[[#This Row],[Strength2]])","v":-1},{"$f":"IF($K$1=1,D135,G135)","v":"approximately"},null,{"$f":"IF($K$1=1,IF(E135=\"\",\"\",E135),IF(H135=\"\",\"\",H135))","v":""},{"$f":"IF($K$1=1,G135,D135)","v":"etwa"}]
[null,"40-Places",{"$f":"IF(AND(LEFT(D136,1)=\"d\",MID(D136,4,1)=\" \"),RIGHT(D136,LEN(D136)-4),D136)","v":"Club"},"der Club",null,0,"club","(English origin)",-4,{"$f":"RAND()","v":0.9383599798779045},{"$f":"IF(Table24[[#This Row],[Type Here]]=\"\",\"\",IF(Table24[[#This Row],[Type Here]]=Table24[[#This Row],[Answer]],1,-2))","v":""},{"$f":"IF($K$1=1,Table24[[#This Row],[Strength1]],Table24[[#This Row],[Strength2]])","v":-4},{"$f":"IF($K$1=1,D136,G136)","v":"club"},null,{"$f":"IF($K$1=1,IF(E136=\"\",\"\",E136),IF(H136=\"\",\"\",H136))","v":"(English origin)"},{"$f":"IF($K$1=1,G136,D136)","v":"der Club"}]
[null,"02-Basics 2",{"$f":"IF(AND(LEFT(D137,1)=\"d\",MID(D137,4,1)=\" \"),RIGHT(D137,LEN(D137)-4),D137)","v":"Zeitung"},"die Zeitung",null,0,"newspaper",null,0,{"$f":"RAND()","v":0.21567541612070984},{"$f":"IF(Table24[[#This Row],[Type Here]]=\"\",\"\",IF(Table24[[#This Row],[Type Here]]=Table24[[#This Row],[Answer]],1,-2))","v":""},{"$f":"IF($K$1=1,Table24[[#This Row],[Strength1]],Table24[[#This Row],[Strength2]])","v":0},{"$f":"IF($K$1=1,D137,G137)","v":"newspaper"},null,{"$f":"IF($K$1=1,IF(E137=\"\",\"\",E137),IF(H137=\"\",\"\",H137))","v":""},{"$f":"IF($K$1=1,G137,D137)","v":"die Zeitung"}]
[null,"33-Adverbs 1",{"$f":"IF(AND(LEFT(D138,1)=\"d\",MID(D138,4,1)=\" \"),RIGHT(D138,LEN(D138)-4),D138)","v":"mindestens"},"mindestens",null,0,"at least",null,-2,{"$f":"RAND()","v":0.8515176430892781},{"$f":"IF(Table24[[#This Row],[Type Here]]=\"\",\"\",IF(Table24[[#This Row],[Type Here]]=Table24[[#This Row],[Answer]],1,-2))","v":""},{"$f":"IF($K$1=1,Table24[[#This Row],[Strength1]],Table24[[#This Row],[Strength2]])","v":-2},{"$f":"IF($K$1=1,D138,G138)","v":"at least"},null,{"$f":"IF($K$1=1,IF(E138=\"\",\"\",E138),IF(H138=\"\",\"\",H138))","v":""},{"$f":"IF($K$1=1,G138,D138)","v":"mindestens"}]
[null,"36-Nature",{"$f":"IF(AND(LEFT(D139,1)=\"d\",MID(D139,4,1)=\" \"),RIGHT(D139,LEN(D139)-4),D139)","v":"Metalle"},"die Metalle",null,0,"metals",null,6,{"$f":"RAND()","v":0.6224413542027243},{"$f":"IF(Table24[[#This Row],[Type Here]]=\"\",\"\",IF(Table24[[#This Row],[Type Here]]=Table24[[#This Row],[Answer]],1,-2))","v":""},{"$f":"IF($K$1=1,Table24[[#This Row],[Strength1]],Table24[[#This Row],[Strength2]])","v":6},{"$f":"IF($K$1=1,D139,G139)","v":"metals"},null,{"$f":"IF($K$1=1,IF(E139=\"\",\"\",E139),IF(H139=\"\",\"\",H139))","v":""},{"$f":"IF($K$1=1,G139,D139)","v":"die Metalle"}]
[null,"29-Medical",{"$f":"IF(AND(LEFT(D140,1)=\"d\",MID(D140,4,1)=\" \"),RIGHT(D140,LEN(D140)-4),D140)","v":"Klinik"},"die Klinik",null,0,"clinic",null,4,{"$f":"RAND()","v":0.30419904524050456},{"$f":"IF(Table24[[#This Row],[Type Here]]=\"\",\"\",IF(Table24[[#This Row],[Type Here]]=Table24[[#This Row],[Answer]],1,-2))","v":""},{"$f":"IF($K$1=1,Table24[[#This Row],[Strength1]],Table24[[#This Row],[Strength2]])","v":4},{"$f":"IF($K$1=1,D140,G140)","v":"clinic"},null,{"$f":"IF($K$1=1,IF(E140=\"\",\"\",E140),IF(H140=\"\",\"\",H140))","v":""},{"$f":"IF($K$1=1,G140,D140)","v":"die Klinik"}]
[null,"40-Places",{"$f":"IF(AND(LEFT(D141,1)=\"d\",MID(D141,4,1)=\" \"),RIGHT(D141,LEN(D141)-4),D141)","v":"Orte"},"die Orte",null,0,"places","scenes",0,{"$f":"RAND()","v":0.760851756610875},{"$f":"IF(Table24[[#This Row],[Type Here]]=\"\",\"\",IF(Table24[[#This Row],[Type Here]]=Table24[[#This Row],[Answer]],1,-2))","v":""},{"$f":"IF($K$1=1,Table24[[#This Row],[Strength1]],Table24[[#This Row],[Strength2]])","v":0},{"$f":"IF($K$1=1,D141,G141)","v":"places"},null,{"$f":"IF($K$1=1,IF(E141=\"\",\"\",E141),IF(H141=\"\",\"\",H141))","v":"scenes"},{"$f":"IF($K$1=1,G141,D141)","v":"die Orte"}]
[null,"01-Basics 1",{"$f":"IF(AND(LEFT(D142,1)=\"d\",MID(D142,4,1)=\" \"),RIGHT(D142,LEN(D142)-4),D142)","v":"gut"},"gut",null,0,"good",null,0,{"$f":"RAND()","v":0.39752343988247296},{"$f":"IF(Table24[[#This Row],[Type Here]]=\"\",\"\",IF(Table24[[#This Row],[Type Here]]=Table24[[#This Row],[Answer]],1,-2))","v":""},{"$f":"IF($K$1=1,Table24[[#This Row],[Strength1]],Table24[[#This Row],[Strength2]])","v":0},{"$f":"IF($K$1=1,D142,G142)","v":"good"},null,{"$f":"IF($K$1=1,IF(E142=\"\",\"\",E142),IF(H142=\"\",\"\",H142))","v":""},{"$f":"IF($K$1=1,G142,D142)","v":"gut"}]
[null,"29-Medical",{"$f":"IF(AND(LEFT(D143,1)=\"d\",MID(D143,4,1)=\" \"),RIGHT(D143,LEN(D143)-4),D143)","v":"Diät"},"die Diät",null,0,"diet",null,3,{"$f":"RAND()","v":0.015415916997902679},{"$f":"IF(Table24[[#This Row],[Type Here]]=\"\",\"\",IF(Table24[[#This Row],[Type Here]]=Table24[[#This Row],[Answer]],1,-2))","v":""},{"$f":"IF($K$1=1,Table24[[#This Row],[Strength1]],Table24[[#This Row],[Strength2]])","v":3},{"$f":"IF($K$1=1,D143,G143)","v":"diet"},null,{"$f":"IF($K$1=1,IF(E143=\"\",\"\",E143),IF(H143=\"\",\"\",H143))","v":""},{"$f":"IF($K$1=1,G143,D143)","v":"die Diät"}]
[null,"04-Food",{"$f":"IF(AND(LEFT(D144,1)=\"d\",MID(D144,4,1)=\" \"),RIGHT(D144,LEN(D144)-4),D144)","v":"Rezepte"},"die Rezepte",null,0,"recipes",null,2,{"$f":"RAND()","v":0.3383599570938468},{"$f":"IF(Table24[[#This Row],[Type Here]]=\"\",\"\",IF(Table24[[#This Row],[Type Here]]=Table24[[#This Row],[Answer]],1,-2))","v":""},{"$f":"IF($K$1=1,Table24[[#This Row],[Strength1]],Table24[[#This Row],[Strength2]])","v":2},{"$f":"IF($K$1=1,D144,G144)","v":"recipes"},null,{"$f":"IF($K$1=1,IF(E144=\"\",\"\",E144),IF(H144=\"\",\"\",H144))","v":""},{"$f":"IF($K$1=1,G144,D144)","v":"die Rezepte"}]
[null,"04-Food",{"$f":"IF(AND(LEFT(D145,1)=\"d\",MID(D145,4,1)=\" \"),RIGHT(D145,LEN(D145)-4),D145)","v":"Hunger"},"der Hunger",null,0,"hunger",null,3,{"$f":"RAND()","v":0.35666762069768665},{"$f":"IF(Table24[[#This Row],[Type Here]]=\"\",\"\",IF(Table24[[#This Row],[Type Here]]=Table24[[#This Row],[Answer]],1,-2))","v":""},{"$f":"IF($K$1=1,Table24[[#This Row],[Strength1]],Table24[[#This Row],[Strength2]])","v":3},{"$f":"IF($K$1=1,D145,G145)","v":"hunger"},null,{"$f":"IF($K$1=1,IF(E145=\"\",\"\",E145),IF(H145=\"\",\"\",H145))","v":""},{"$f":"IF($K$1=1,G145,D145)","v":"der Hunger"}]
[null,"36-Nature",{"$f":"IF(AND(LEFT(D146,1)=\"d\",MID(D146,4,1)=\" \"),RIGHT(D146,LEN(D146)-4),D146)","v":"Sonne"},"die Sonne",null,0,"sun",null,6,{"$f":"RAND()","v":0.8043173730561414},{"$f":"IF(Table24[[#This Row],[Type Here]]=\"\",\"\",IF(Table24[[#This Row],[Type Here]]=Table24[[#This Row],[Answer]],1,-2))","v":""},{"$f":"IF($K$1=1,Table24[[#This Row],[Strength1]],Table24[[#This Row],[Strength2]])","v":6},{"$f":"IF($K$1=1,D146,G146)","v":"sun"},null,{"$f":"IF($K$1=1,IF(E146=\"\",\"\",E146),IF(H146=\"\",\"\",H146))","v":""},{"$f":"IF($K$1=1,G146,D146)","v":"die Sonne"}]
[null,"07-Adjectives",{"$f":"IF(AND(LEFT(D147,1)=\"d\",MID(D147,4,1)=\" \"),RIGHT(D147,LEN(D147)-4),D147)","v":"positiv"},"positiv",null,0,"positive",null,0,{"$f":"RAND()","v":0.9666390513630386},{"$f":"IF(Table24[[#This Row],[Type Here]]=\"\",\"\",IF(Table24[[#This Row],[Type Here]]=Table24[[#This Row],[Answer]],1,-2))","v":""},{"$f":"IF($K$1=1,Table24[[#This Row],[Strength1]],Table24[[#This Row],[Strength2]])","v":0},{"$f":"IF($K$1=1,D147,G147)","v":"positive"},null,{"$f":"IF($K$1=1,IF(E147=\"\",\"\",E147),IF(H147=\"\",\"\",H147))","v":""},{"$f":"IF($K$1=1,G147,D147)","v":"positiv"}]
[null,"29-Medical",{"$f":"IF(AND(LEFT(D148,1)=\"d\",MID(D148,4,1)=\" \"),RIGHT(D148,LEN(D148)-4),D148)","v":"Patientinnen"},"die Patientinnen",null,0,"patients","female (medical)",5,{"$f":"RAND()","v":0.6970275890885097},{"$f":"IF(Table24[[#This Row],[Type Here]]=\"\",\"\",IF(Table24[[#This Row],[Type Here]]=Table24[[#This Row],[Answer]],1,-2))","v":""},{"$f":"IF($K$1=1,Table24[[#This Row],[Strength1]],Table24[[#This Row],[Strength2]])","v":5},{"$f":"IF($K$1=1,D148,G148)","v":"patients"},null,{"$f":"IF($K$1=1,IF(E148=\"\",\"\",E148),IF(H148=\"\",\"\",H148))","v":"female (medical)"},{"$f":"IF($K$1=1,G148,D148)","v":"die Patientinnen"}]
[null,"33-Adverbs 1",{"$f":"IF(AND(LEFT(D149,1)=\"d\",MID(D149,4,1)=\" \"),RIGHT(D149,LEN(D149)-4),D149)","v":"hier"},"hier",null,0,"here",null,1,{"$f":"RAND()","v":0.04105625654298117},{"$f":"IF(Table24[[#This Row],[Type Here]]=\"\",\"\",IF(Table24[[#This Row],[Type Here]]=Table24[[#This Row],[Answer]],1,-2))","v":""},{"$f":"IF($K$1=1,Table24[[#This Row],[Strength1]],Table24[[#This Row],[Strength2]])","v":1},{"$f":"IF($K$1=1,D149,G149)","v":"here"},null,{"$f":"IF($K$1=1,IF(E149=\"\",\"\",E149),IF(H149=\"\",\"\",H149))","v":""},{"$f":"IF($K$1=1,G149,D149)","v":"hier"}]
[null,"33-Adverbs 1",{"$f":"IF(AND(LEFT(D150,1)=\"d\",MID(D150,4,1)=\" \"),RIGHT(D150,LEN(D150)-4),D150)","v":"fast"},"fast",null,0,"almost",null,0,{"$f":"RAND()","v":0.9057617094540522},{"$f":"IF(Table24[[#This Row],[Type Here]]=\"\",\"\",IF(Table24[[#This Row],[Type Here]]=Table24[[#This Row],[Answer]],1,-2))","v":""},{"$f":"IF($K$1=1,Table24[[#This Row],[Strength1]],Table24[[#This Row],[Strength2]])","v":0},{"$f":"IF($K$1=1,D150,G150)","v":"almost"},null,{"$f":"IF($K$1=1,IF(E150=\"\",\"\",E150),IF(H150=\"\",\"\",H150))","v":""},{"$f":"IF($K$1=1,G150,D150)","v":"fast"}]
[null,"22-Colors",{"$f":"IF(AND(LEFT(D151,1)=\"d\",MID(D151,4,1)=\" \"),RIGHT(D151,LEN(D151)-4),D151)","v":"gelb"},"gelb",null,0,"yellow",null,1,{"$f":"RAND()","v":0.6412271174546773},{"$f":"IF(Table24[[#This Row],[Type Here]]=\"\",\"\",IF(Table24[[#This Row],[Type Here]]=Table24[[#This Row],[Answer]],1,-2))","v":""},{"$f":"IF($K$1=1,Table24[[#This Row],[Strength1]],Table24[[#This Row],[Strength2]])","v":1},{"$f":"IF($K$1=1,D151,G151)","v":"yellow"},null,{"$f":"IF($K$1=1,IF(E151=\"\",\"\",E151),IF(H151=\"\",\"\",H151))","v":""},{"$f":"IF($K$1=1,G151,D151)","v":"gelb"}]
[null,"36-Nature",{"$f":"IF(AND(LEFT(D152,1)=\"d\",MID(D152,4,1)=\" \"),RIGHT(D152,LEN(D152)-4),D152)","v":"Steine"},"die Steine",null,0,"stones","noun",6,{"$f":"RAND()","v":0.05556974063877529},{"$f":"IF(Table24[[#This Row],[Type Here]]=\"\",\"\",IF(Table24[[#This Row],[Type Here]]=Table24[[#This Row],[Answer]],1,-2))","v":""},{"$f":"IF($K$1=1,Table24[[#This Row],[Strength1]],Table24[[#This Row],[Strength2]])","v":6},{"$f":"IF($K$1=1,D152,G152)","v":"stones"},null,{"$f":"IF($K$1=1,IF(E152=\"\",\"\",E152),IF(H152=\"\",\"\",H152))","v":"noun"},{"$f":"IF($K$1=1,G152,D152)","v":"die Steine"}]
[null,"02-Basics 2",{"$f":"IF(AND(LEFT(D153,1)=\"d\",MID(D153,4,1)=\" \"),RIGHT(D153,LEN(D153)-4),D153)","v":"Frauen"},"die Frauen","(gender)",0,"women",null,0,{"$f":"RAND()","v":0.3116011096562823},{"$f":"IF(Table24[[#This Row],[Type Here]]=\"\",\"\",IF(Table24[[#This Row],[Type Here]]=Table24[[#This Row],[Answer]],1,-2))","v":""},{"$f":"IF($K$1=1,Table24[[#This Row],[Strength1]],Table24[[#This Row],[Strength2]])","v":0},{"$f":"IF($K$1=1,D153,G153)","v":"women"},null,{"$f":"IF($K$1=1,IF(E153=\"\",\"\",E153),IF(H153=\"\",\"\",H153))","v":""},{"$f":"IF($K$1=1,G153,D153)","v":"die Frauen"}]
[null,"10-Nom. Pron.",{"$f":"IF(AND(LEFT(D154,1)=\"d\",MID(D154,4,1)=\" \"),RIGHT(D154,LEN(D154)-4),D154)","v":"niemand"},"niemand",null,0,"no one",null,1,{"$f":"RAND()","v":0.2725638296382902},{"$f":"IF(Table24[[#This Row],[Type Here]]=\"\",\"\",IF(Table24[[#This Row],[Type Here]]=Table24[[#This Row],[Answer]],1,-2))","v":""},{"$f":"IF($K$1=1,Table24[[#This Row],[Strength1]],Table24[[#This Row],[Strength2]])","v":1},{"$f":"IF($K$1=1,D154,G154)","v":"no one"},null,{"$f":"IF($K$1=1,IF(E154=\"\",\"\",E154),IF(H154=\"\",\"\",H154))","v":""},{"$f":"IF($K$1=1,G154,D154)","v":"niemand"}]
[null,"11-Family",{"$f":"IF(AND(LEFT(D155,1)=\"d\",MID(D155,4,1)=\" \"),RIGHT(D155,LEN(D155)-4),D155)","v":"Beziehung"},"die Beziehung",null,null,"relationship",null,null,{"$f":"RAND()","v":0.3684117028015639},{"$f":"IF(Table24[[#This Row],[Type Here]]=\"\",\"\",IF(Table24[[#This Row],[Type Here]]=Table24[[#This Row],[Answer]],1,-2))","v":""},{"$f":"IF($K$1=1,Table24[[#This Row],[Strength1]],Table24[[#This Row],[Strength2]])","v":0},{"$f":"IF($K$1=1,D155,G155)","v":"relationship"},null,{"$f":"IF($K$1=1,IF(E155=\"\",\"\",E155),IF(H155=\"\",\"\",H155))","v":""},{"$f":"IF($K$1=1,G155,D155)","v":"die Beziehung"}]
[null,"04-Food",{"$f":"IF(AND(LEFT(D156,1)=\"d\",MID(D156,4,1)=\" \"),RIGHT(D156,LEN(D156)-4),D156)","v":"salzig"},"salzig",null,0,"salty",null,2,{"$f":"RAND()","v":0.7863420033211929},{"$f":"IF(Table24[[#This Row],[Type Here]]=\"\",\"\",IF(Table24[[#This Row],[Type Here]]=Table24[[#This Row],[Answer]],1,-2))","v":""},{"$f":"IF($K$1=1,Table24[[#This Row],[Strength1]],Table24[[#This Row],[Strength2]])","v":2},{"$f":"IF($K$1=1,D156,G156)","v":"salty"},null,{"$f":"IF($K$1=1,IF(E156=\"\",\"\",E156),IF(H156=\"\",\"\",H156))","v":""},{"$f":"IF($K$1=1,G156,D156)","v":"salzig"}]
[null,"40-Places",{"$f":"IF(AND(LEFT(D157,1)=\"d\",MID(D157,4,1)=\" \"),RIGHT(D157,LEN(D157)-4),D157)","v":"Bahnhöfe"},"die Bahnhöfe",null,0,"stations","train stations",0,{"$f":"RAND()","v":0.8314026796466555},{"$f":"IF(Table24[[#This Row],[Type Here]]=\"\",\"\",IF(Table24[[#This Row],[Type Here]]=Table24[[#This Row],[Answer]],1,-2))","v":""},{"$f":"IF($K$1=1,Table24[[#This Row],[Strength1]],Table24[[#This Row],[Strength2]])","v":0},{"$f":"IF($K$1=1,D157,G157)","v":"stations"},null,{"$f":"IF($K$1=1,IF(E157=\"\",\"\",E157),IF(H157=\"\",\"\",H157))","v":"train stations"},{"$f":"IF($K$1=1,G157,D157)","v":"die Bahnhöfe"}]
[null,"04-Food",{"$f":"IF(AND(LEFT(D158,1)=\"d\",MID(D158,4,1)=\" \"),RIGHT(D158,LEN(D158)-4),D158)","v":"Obst"},"das Obst",null,0,"fruit",null,1,{"$f":"RAND()","v":0.9593007042965799},{"$f":"IF(Table24[[#This Row],[Type Here]]=\"\",\"\",IF(Table24[[#This Row],[Type Here]]=Table24[[#This Row],[Answer]],1,-2))","v":""},{"$f":"IF($K$1=1,Table24[[#This Row],[Strength1]],Table24[[#This Row],[Strength2]])","v":1},{"$f":"IF($K$1=1,D158,G158)","v":"fruit"},null,{"$f":"IF($K$1=1,IF(E158=\"\",\"\",E158),IF(H158=\"\",\"\",H158))","v":""},{"$f":"IF($K$1=1,G158,D158)","v":"das Obst"}]
[null,"14-Household",{"$f":"IF(AND(LEFT(D159,1)=\"d\",MID(D159,4,1)=\" \"),RIGHT(D159,LEN(D159)-4),D159)","v":"Zahnbürste"},"die Zahnbürste",null,0,"tooth brush",null,-2,{"$f":"RAND()","v":0.7933792404143466},{"$f":"IF(Table24[[#This Row],[Type Here]]=\"\",\"\",IF(Table24[[#This Row],[Type Here]]=Table24[[#This Row],[Answer]],1,-2))","v":""},{"$f":"IF($K$1=1,Table24[[#This Row],[Strength1]],Table24[[#This Row],[Strength2]])","v":-2},{"$f":"IF($K$1=1,D159,G159)","v":"tooth brush"},null,{"$f":"IF($K$1=1,IF(E159=\"\",\"\",E159),IF(H159=\"\",\"\",H159))","v":""},{"$f":"IF($K$1=1,G159,D159)","v":"die Zahnbürste"}]
[null,"07-Adjectives",{"$f":"IF(AND(LEFT(D160,1)=\"d\",MID(D160,4,1)=\" \"),RIGHT(D160,LEN(D160)-4),D160)","v":"stark"},"stark",null,0,"strong",null,8,{"$f":"RAND()","v":0.9798586797215222},{"$f":"IF(Table24[[#This Row],[Type Here]]=\"\",\"\",IF(Table24[[#This Row],[Type Here]]=Table24[[#This Row],[Answer]],1,-2))","v":""},{"$f":"IF($K$1=1,Table24[[#This Row],[Strength1]],Table24[[#This Row],[Strength2]])","v":8},{"$f":"IF($K$1=1,D160,G160)","v":"strong"},null,{"$f":"IF($K$1=1,IF(E160=\"\",\"\",E160),IF(H160=\"\",\"\",H160))","v":""},{"$f":"IF($K$1=1,G160,D160)","v":"stark"}]
[null,"08-V. Pres. 1",{"$f":"IF(AND(LEFT(D161,1)=\"d\",MID(D161,4,1)=\" \"),RIGHT(D161,LEN(D161)-4),D161)","v":"kennen"},"kennen",null,0,"to know",null,0,{"$f":"RAND()","v":0.5668079666523241},{"$f":"IF(Table24[[#This Row],[Type Here]]=\"\",\"\",IF(Table24[[#This Row],[Type Here]]=Table24[[#This Row],[Answer]],1,-2))","v":""},{"$f":"IF($K$1=1,Table24[[#This Row],[Strength1]],Table24[[#This Row],[Strength2]])","v":0},{"$f":"IF($K$1=1,D161,G161)","v":"to know"},null,{"$f":"IF($K$1=1,IF(E161=\"\",\"\",E161),IF(H161=\"\",\"\",H161))","v":""},{"$f":"IF($K$1=1,G161,D161)","v":"kennen"}]
[null,"14-Household",{"$f":"IF(AND(LEFT(D162,1)=\"d\",MID(D162,4,1)=\" \"),RIGHT(D162,LEN(D162)-4),D162)","v":"Toiletten"},"die Toiletten",null,0,"toilets",null,3,{"$f":"RAND()","v":0.16705544794169647},{"$f":"IF(Table24[[#This Row],[Type Here]]=\"\",\"\",IF(Table24[[#This Row],[Type Here]]=Table24[[#This Row],[Answer]],1,-2))","v":""},{"$f":"IF($K$1=1,Table24[[#This Row],[Strength1]],Table24[[#This Row],[Strength2]])","v":3},{"$f":"IF($K$1=1,D162,G162)","v":"toilets"},null,{"$f":"IF($K$1=1,IF(E162=\"\",\"\",E162),IF(H162=\"\",\"\",H162))","v":""},{"$f":"IF($K$1=1,G162,D162)","v":"die Toiletten"}]
[null,"33-Adverbs 1",{"$f":"IF(AND(LEFT(D163,1)=\"d\",MID(D163,4,1)=\" \"),RIGHT(D163,LEN(D163)-4),D163)","v":"dazu"},"dazu",null,0,"for it",null,-2,{"$f":"RAND()","v":0.9491541559163843},{"$f":"IF(Table24[[#This Row],[Type Here]]=\"\",\"\",IF(Table24[[#This Row],[Type Here]]=Table24[[#This Row],[Answer]],1,-2))","v":""},{"$f":"IF($K$1=1,Table24[[#This Row],[Strength1]],Table24[[#This Row],[Strength2]])","v":-2},{"$f":"IF($K$1=1,D163,G163)","v":"for it"},null,{"$f":"IF($K$1=1,IF(E163=\"\",\"\",E163),IF(H163=\"\",\"\",H163))","v":""},{"$f":"IF($K$1=1,G163,D163)","v":"dazu"}]
[null,"14-Household",{"$f":"IF(AND(LEFT(D164,1)=\"d\",MID(D164,4,1)=\" \"),RIGHT(D164,LEN(D164)-4),D164)","v":"Batterie"},"die Batterie",null,0,"battery",null,1,{"$f":"RAND()","v":0.7335162028141476},{"$f":"IF(Table24[[#This Row],[Type Here]]=\"\",\"\",IF(Table24[[#This Row],[Type Here]]=Table24[[#This Row],[Answer]],1,-2))","v":""},{"$f":"IF($K$1=1,Table24[[#This Row],[Strength1]],Table24[[#This Row],[Strength2]])","v":1},{"$f":"IF($K$1=1,D164,G164)","v":"battery"},null,{"$f":"IF($K$1=1,IF(E164=\"\",\"\",E164),IF(H164=\"\",\"\",H164))","v":""},{"$f":"IF($K$1=1,G164,D164)","v":"die Batterie"}]
[null,"36-Nature",{"$f":"IF(AND(LEFT(D165,1)=\"d\",MID(D165,4,1)=\" \"),RIGHT(D165,LEN(D165)-4),D165)","v":"Feuer"},"das Feuer",null,0,"fire",null,6,{"$f":"RAND()","v":0.0955253931558876},{"$f":"IF(Table24[[#This Row],[Type Here]]=\"\",\"\",IF(Table24[[#This Row],[Type Here]]=Table24[[#This Row],[Answer]],1,-2))","v":""},{"$f":"IF($K$1=1,Table24[[#This Row],[Strength1]],Table24[[#This Row],[Strength2]])","v":6},{"$f":"IF($K$1=1,D165,G165)","v":"fire"},null,{"$f":"IF($K$1=1,IF(E165=\"\",\"\",E165),IF(H165=\"\",\"\",H165))","v":""},{"$f":"IF($K$1=1,G165,D165)","v":"das Feuer"}]
[null,"33-Adverbs 1",{"$f":"IF(AND(LEFT(D166,1)=\"d\",MID(D166,4,1)=\" \"),RIGHT(D166,LEN(D166)-4),D166)","v":"auch"},"auch",null,0,"too",null,0,{"$f":"RAND()","v":0.9374956154825596},{"$f":"IF(Table24[[#This Row],[Type Here]]=\"\",\"\",IF(Table24[[#This Row],[Type Here]]=Table24[[#This Row],[Answer]],1,-2))","v":""},{"$f":"IF($K$1=1,Table24[[#This Row],[Strength1]],Table24[[#This Row],[Strength2]])","v":0},{"$f":"IF($K$1=1,D166,G166)","v":"too"},null,{"$f":"IF($K$1=1,IF(E166=\"\",\"\",E166),IF(H166=\"\",\"\",H166))","v":""},{"$f":"IF($K$1=1,G166,D166)","v":"auch"}]
[null,"36-Nature",{"$f":"IF(AND(LEFT(D167,1)=\"d\",MID(D167,4,1)=\" \"),RIGHT(D167,LEN(D167)-4),D167)","v":"Himmel"},"der Himmel","(afterlife)",0,"heaven",null,6,{"$f":"RAND()","v":0.5049739038462431},{"$f":"IF(Table24[[#This Row],[Type Here]]=\"\",\"\",IF(Table24[[#This Row],[Type Here]]=Table24[[#This Row],[Answer]],1,-2))","v":""},{"$f":"IF($K$1=1,Table24[[#This Row],[Strength1]],Table24[[#This Row],[Strength2]])","v":6},{"$f":"IF($K$1=1,D167,G167)","v":"heaven"},null,{"$f":"IF($K$1=1,IF(E167=\"\",\"\",E167),IF(H167=\"\",\"\",H167))","v":""},{"$f":"IF($K$1=1,G167,D167)","v":"der Himmel"}]
[null,"38-Ad: Nom. 1",{"$f":"IF(AND(LEFT(D168,1)=\"d\",MID(D168,4,1)=\" \"),RIGHT(D168,LEN(D168)-4),D168)","v":"hoher Tisch"},"hoher Tisch",null,0,"high table","Nominative",2,{"$f":"RAND()","v":0.4708820491439911},{"$f":"IF(Table24[[#This Row],[Type Here]]=\"\",\"\",IF(Table24[[#This Row],[Type Here]]=Table24[[#This Row],[Answer]],1,-2))","v":""},{"$f":"IF($K$1=1,Table24[[#This Row],[Strength1]],Table24[[#This Row],[Strength2]])","v":2},{"$f":"IF($K$1=1,D168,G168)","v":"high table"},null,{"$f":"IF($K$1=1,IF(E168=\"\",\"\",E168),IF(H168=\"\",\"\",H168))","v":"Nominative"},{"$f":"IF($K$1=1,G168,D168)","v":"hoher Tisch"}]
[null,"08-V. Pres. 1",{"$f":"IF(AND(LEFT(D169,1)=\"d\",MID(D169,4,1)=\" \"),RIGHT(D169,LEN(D169)-4),D169)","v":"gehen"},"gehen",null,0,"to go",null,0,{"$f":"RAND()","v":0.3259447762679111},{"$f":"IF(Table24[[#This Row],[Type Here]]=\"\",\"\",IF(Table24[[#This Row],[Type Here]]=Table24[[#This Row],[Answer]],1,-2))","v":""},{"$f":"IF($K$1=1,Table24[[#This Row],[Strength1]],Table24[[#This Row],[Strength2]])","v":0},{"$f":"IF($K$1=1,D169,G169)","v":"to go"},null,{"$f":"IF($K$1=1,IF(E169=\"\",\"\",E169),IF(H169=\"\",\"\",H169))","v":""},{"$f":"IF($K$1=1,G169,D169)","v":"gehen"}]
[null,"14-Household",{"$f":"IF(AND(LEFT(D170,1)=\"d\",MID(D170,4,1)=\" \"),RIGHT(D170,LEN(D170)-4),D170)","v":"Balkon"},"der Balkon",null,0,"balcony",null,-2,{"$f":"RAND()","v":0.5015920561147067},{"$f":"IF(Table24[[#This Row],[Type Here]]=\"\",\"\",IF(Table24[[#This Row],[Type Here]]=Table24[[#This Row],[Answer]],1,-2))","v":""},{"$f":"IF($K$1=1,Table24[[#This Row],[Strength1]],Table24[[#This Row],[Strength2]])","v":-2},{"$f":"IF($K$1=1,D170,G170)","v":"balcony"},null,{"$f":"IF($K$1=1,IF(E170=\"\",\"\",E170),IF(H170=\"\",\"\",H170))","v":""},{"$f":"IF($K$1=1,G170,D170)","v":"der Balkon"}]
[null,"33-Adverbs 1",{"$f":"IF(AND(LEFT(D171,1)=\"d\",MID(D171,4,1)=\" \"),RIGHT(D171,LEN(D171)-4),D171)","v":"nun"},"nun",null,0,"now","(by now, broadly)",0,{"$f":"RAND()","v":0.33852791249485004},{"$f":"IF(Table24[[#This Row],[Type Here]]=\"\",\"\",IF(Table24[[#This Row],[Type Here]]=Table24[[#This Row],[Answer]],1,-2))","v":""},{"$f":"IF($K$1=1,Table24[[#This Row],[Strength1]],Table24[[#This Row],[Strength2]])","v":0},{"$f":"IF($K$1=1,D171,G171)","v":"now"},null,{"$f":"IF($K$1=1,IF(E171=\"\",\"\",E171),IF(H171=\"\",\"\",H171))","v":"(by now, broadly)"},{"$f":"IF($K$1=1,G171,D171)","v":"nun"}]
[null,"04-Food",{"$f":"IF(AND(LEFT(D172,1)=\"d\",MID(D172,4,1)=\" \"),RIGHT(D172,LEN(D172)-4),D172)","v":"Mittagessen"},"das Mittagessen",null,0,"lunch",null,4,{"$f":"RAND()","v":0.770457756348169},{"$f":"IF(Table24[[#This Row],[Type Here]]=\"\",\"\",IF(Table24[[#This Row],[Type Here]]=Table24[[#This Row],[Answer]],1,-2))","v":""},{"$f":"IF($K$1=1,Table24[[#This Row],[Strength1]],Table24[[#This Row],[Strength2]])","v":4},{"$f":"IF($K$1=1,D172,G172)","v":"lunch"},null,{"$f":"IF($K$1=1,IF(E172=\"\",\"\",E172),IF(H172=\"\",\"\",H172))","v":""},{"$f":"IF($K$1=1,G172,D172)","v":"das Mittagessen"}]
[null,"01-Basics 1",{"$f":"IF(AND(LEFT(D173,1)=\"d\",MID(D173,4,1)=\" \"),RIGHT(D173,LEN(D173)-4),D173)","v":"Kind"},"das Kind",null,0,"child",null,0,{"$f":"RAND()","v":0.6168571220287584},{"$f":"IF(Table24[[#This Row],[Type Here]]=\"\",\"\",IF(Table24[[#This Row],[Type Here]]=Table24[[#This Row],[Answer]],1,-2))","v":""},{"$f":"IF($K$1=1,Table24[[#This Row],[Strength1]],Table24[[#This Row],[Strength2]])","v":0},{"$f":"IF($K$1=1,D173,G173)","v":"child"},null,{"$f":"IF($K$1=1,IF(E173=\"\",\"\",E173),IF(H173=\"\",\"\",H173))","v":""},{"$f":"IF($K$1=1,G173,D173)","v":"das Kind"}]
[null,"29-Medical",{"$f":"IF(AND(LEFT(D174,1)=\"d\",MID(D174,4,1)=\" \"),RIGHT(D174,LEN(D174)-4),D174)","v":"Köpfe"},"die Köpfe",null,0,"heads","anatomy",4,{"$f":"RAND()","v":0.962618976565181},{"$f":"IF(Table24[[#This Row],[Type Here]]=\"\",\"\",IF(Table24[[#This Row],[Type Here]]=Table24[[#This Row],[Answer]],1,-2))","v":""},{"$f":"IF($K$1=1,Table24[[#This Row],[Strength1]],Table24[[#This Row],[Strength2]])","v":4},{"$f":"IF($K$1=1,D174,G174)","v":"heads"},null,{"$f":"IF($K$1=1,IF(E174=\"\",\"\",E174),IF(H174=\"\",\"\",H174))","v":"anatomy"},{"$f":"IF($K$1=1,G174,D174)","v":"die Köpfe"}]
[null,"04-Food",{"$f":"IF(AND(LEFT(D175,1)=\"d\",MID(D175,4,1)=\" \"),RIGHT(D175,LEN(D175)-4),D175)","v":"Erdbeere"},"die Erdbeere",null,0,"strawberry",null,1,{"$f":"RAND()","v":0.923455186997581},{"$f":"IF(Table24[[#This Row],[Type Here]]=\"\",\"\",IF(Table24[[#This Row],[Type Here]]=Table24[[#This Row],[Answer]],1,-2))","v":""},{"$f":"IF($K$1=1,Table24[[#This Row],[Strength1]],Table24[[#This Row],[Strength2]])","v":1},{"$f":"IF($K$1=1,D175,G175)","v":"strawberry"},null,{"$f":"IF($K$1=1,IF(E175=\"\",\"\",E175),IF(H175=\"\",\"\",H175))","v":""},{"$f":"IF($K$1=1,G175,D175)","v":"die Erdbeere"}]
[null,"14-Household",{"$f":"IF(AND(LEFT(D176,1)=\"d\",MID(D176,4,1)=\" \"),RIGHT(D176,LEN(D176)-4),D176)","v":"Tor"},"das Tor",null,0,"gate","(goal)",1,{"$f":"RAND()","v":0.8196291851391122},{"$f":"IF(Table24[[#This Row],[Type Here]]=\"\",\"\",IF(Table24[[#This Row],[Type Here]]=Table24[[#This Row],[Answer]],1,-2))","v":""},{"$f":"IF($K$1=1,Table24[[#This Row],[Strength1]],Table24[[#This Row],[Strength2]])","v":1},{"$f":"IF($K$1=1,D176,G176)","v":"gate"},null,{"$f":"IF($K$1=1,IF(E176=\"\",\"\",E176),IF(H176=\"\",\"\",H176))","v":"(goal)"},{"$f":"IF($K$1=1,G176,D176)","v":"das Tor"}]
[null,"29-Medical",{"$f":"IF(AND(LEFT(D177,1)=\"d\",MID(D177,4,1)=\" \"),RIGHT(D177,LEN(D177)-4),D177)","v":"Bein"},"das Bein",null,0,"leg",null,0,{"$f":"RAND()","v":0.5830738907845697},{"$f":"IF(Table24[[#This Row],[Type Here]]=\"\",\"\",IF(Table24[[#This Row],[Type Here]]=Table24[[#This Row],[Answer]],1,-2))","v":""},{"$f":"IF($K$1=1,Table24[[#This Row],[Strength1]],Table24[[#This Row],[Strength2]])","v":0},{"$f":"IF($K$1=1,D177,G177)","v":"leg"},null,{"$f":"IF($K$1=1,IF(E177=\"\",\"\",E177),IF(H177=\"\",\"\",H177))","v":""},{"$f":"IF($K$1=1,G177,D177)","v":"das Bein"}]
[null,"09-Clothing",{"$f":"IF(AND(LEFT(D178,1)=\"d\",MID(D178,4,1)=\" \"),RIGHT(D178,LEN(D178)-4),D178)","v":"Jacke"},"die Jacke",null,0,"jacket",null,1,{"$f":"RAND()","v":0.29159431852910456},{"$f":"IF(Table24[[#This Row],[Type Here]]=\"\",\"\",IF(Table24[[#This Row],[Type Here]]=Table24[[#This Row],[Answer]],1,-2))","v":""},{"$f":"IF($K$1=1,Table24[[#This Row],[Strength1]],Table24[[#This Row],[Strength2]])","v":1},{"$f":"IF($K$1=1,D178,G178)","v":"jacket"},null,{"$f":"IF($K$1=1,IF(E178=\"\",\"\",E178),IF(H178=\"\",\"\",H178))","v":""},{"$f":"IF($K$1=1,G178,D178)","v":"die Jacke"}]
[null,"14-Household",{"$f":"IF(AND(LEFT(D179,1)=\"d\",MID(D179,4,1)=\" \"),RIGHT(D179,LEN(D179)-4),D179)","v":"Lichter"},"die Lichter",null,0,"lights",null,0,{"$f":"RAND()","v":0.08937193663190413},{"$f":"IF(Table24[[#This Row],[Type Here]]=\"\",\"\",IF(Table24[[#This Row],[Type Here]]=Table24[[#This Row],[Answer]],1,-2))","v":""},{"$f":"IF($K$1=1,Table24[[#This Row],[Strength1]],Table24[[#This Row],[Strength2]])","v":0},{"$f":"IF($K$1=1,D179,G179)","v":"lights"},null,{"$f":"IF($K$1=1,IF(E179=\"\",\"\",E179),IF(H179=\"\",\"\",H179))","v":""},{"$f":"IF($K$1=1,G179,D179)","v":"die Lichter"}]
[null,"01-Basics 1",{"$f":"IF(AND(LEFT(D180,1)=\"d\",MID(D180,4,1)=\" \"),RIGHT(D180,LEN(D180)-4),D180)","v":"der"},"der","(article - Gen plural)",0,"the","Gen plural",0,{"$f":"RAND()","v":0.9017667170519622},{"$f":"IF(Table24[[#This Row],[Type Here]]=\"\",\"\",IF(Table24[[#This Row],[Type Here]]=Table24[[#This Row],[Answer]],1,-2))","v":""},{"$f":"IF($K$1=1,Table24[[#This Row],[Strength1]],Table24[[#This Row],[Strength2]])","v":0},{"$f":"IF($K$1=1,D180,G180)","v":"the"},null,{"$f":"IF($K$1=1,IF(E180=\"\",\"\",E180),IF(H180=\"\",\"\",H180))","v":"Gen plural"},{"$f":"IF($K$1=1,G180,D180)","v":"der"}]
[null,"40-Places",{"$f":"IF(AND(LEFT(D181,1)=\"d\",MID(D181,4,1)=\" \"),RIGHT(D181,LEN(D181)-4),D181)","v":"Heimat"},"die Heimat",null,0,"home","(native land or place)",0,{"$f":"RAND()","v":0.3090678604758229},{"$f":"IF(Table24[[#This Row],[Type Here]]=\"\",\"\",IF(Table24[[#This Row],[Type Here]]=Table24[[#This Row],[Answer]],1,-2))","v":""},{"$f":"IF($K$1=1,Table24[[#This Row],[Strength1]],Table24[[#This Row],[Strength2]])","v":0},{"$f":"IF($K$1=1,D181,G181)","v":"home"},null,{"$f":"IF($K$1=1,IF(E181=\"\",\"\",E181),IF(H181=\"\",\"\",H181))","v":"(native land or place)"},{"$f":"IF($K$1=1,G181,D181)","v":"die Heimat"}]
[null,"14-Household",{"$f":"IF(AND(LEFT(D182,1)=\"d\",MID(D182,4,1)=\" \"),RIGHT(D182,LEN(D182)-4),D182)","v":"Toilette"},"die Toilette",null,0,"toilet",null,1,{"$f":"RAND()","v":0.48663847448946107},{"$f":"IF(Table24[[#This Row],[Type Here]]=\"\",\"\",IF(Table24[[#This Row],[Type Here]]=Table24[[#This Row],[Answer]],1,-2))","v":""},{"$f":"IF($K$1=1,Table24[[#This Row],[Strength1]],Table24[[#This Row],[Strength2]])","v":1},{"$f":"IF($K$1=1,D182,G182)","v":"toilet"},null,{"$f":"IF($K$1=1,IF(E182=\"\",\"\",E182),IF(H182=\"\",\"\",H182))","v":""},{"$f":"IF($K$1=1,G182,D182)","v":"die Toilette"}]
[null,"01-Basics 1",{"$f":"IF(AND(LEFT(D183,1)=\"d\",MID(D183,4,1)=\" \"),RIGHT(D183,LEN(D183)-4),D183)","v":"Junge"},"der Junge",null,0,"boy",null,0,{"$f":"RAND()","v":3.4103939986875886E-3},{"$f":"IF(Table24[[#This Row],[Type Here]]=\"\",\"\",IF(Table24[[#This Row],[Type Here]]=Table24[[#This Row],[Answer]],1,-2))","v":""},{"$f":"IF($K$1=1,Table24[[#This Row],[Strength1]],Table24[[#This Row],[Strength2]])","v":0},{"$f":"IF($K$1=1,D183,G183)","v":"boy"},null,{"$f":"IF($K$1=1,IF(E183=\"\",\"\",E183),IF(H183=\"\",\"\",H183))","v":""},{"$f":"IF($K$1=1,G183,D183)","v":"der Junge"}]
[null,"33-Adverbs 1",{"$f":"IF(AND(LEFT(D184,1)=\"d\",MID(D184,4,1)=\" \"),RIGHT(D184,LEN(D184)-4),D184)","v":"gestern"},"gestern",null,0,"yesterday",null,1,{"$f":"RAND()","v":0.3414923691766294},{"$f":"IF(Table24[[#This Row],[Type Here]]=\"\",\"\",IF(Table24[[#This Row],[Type Here]]=Table24[[#This Row],[Answer]],1,-2))","v":""},{"$f":"IF($K$1=1,Table24[[#This Row],[Strength1]],Table24[[#This Row],[Strength2]])","v":1},{"$f":"IF($K$1=1,D184,G184)","v":"yesterday"},null,{"$f":"IF($K$1=1,IF(E184=\"\",\"\",E184),IF(H184=\"\",\"\",H184))","v":""},{"$f":"IF($K$1=1,G184,D184)","v":"gestern"}]
[null,"33-Adverbs 1",{"$f":"IF(AND(LEFT(D185,1)=\"d\",MID(D185,4,1)=\" \"),RIGHT(D185,LEN(D185)-4),D185)","v":"dann"},"dann",null,0,"then",null,2,{"$f":"RAND()","v":0.11242066948562068},{"$f":"IF(Table24[[#This Row],[Type Here]]=\"\",\"\",IF(Table24[[#This Row],[Type Here]]=Table24[[#This Row],[Answer]],1,-2))","v":""},{"$f":"IF($K$1=1,Table24[[#This Row],[Strength1]],Table24[[#This Row],[Strength2]])","v":2},{"$f":"IF($K$1=1,D185,G185)","v":"then"},null,{"$f":"IF($K$1=1,IF(E185=\"\",\"\",E185),IF(H185=\"\",\"\",H185))","v":""},{"$f":"IF($K$1=1,G185,D185)","v":"dann"}]
[null,"07-Adjectives",{"$f":"IF(AND(LEFT(D186,1)=\"d\",MID(D186,4,1)=\" \"),RIGHT(D186,LEN(D186)-4),D186)","v":"frei"},"frei",null,0,"free","(free of)",0,{"$f":"RAND()","v":0.5342817471042202},{"$f":"IF(Table24[[#This Row],[Type Here]]=\"\",\"\",IF(Table24[[#This Row],[Type Here]]=Table24[[#This Row],[Answer]],1,-2))","v":""},{"$f":"IF($K$1=1,Table24[[#This Row],[Strength1]],Table24[[#This Row],[Strength2]])","v":0},{"$f":"IF($K$1=1,D186,G186)","v":"free"},null,{"$f":"IF($K$1=1,IF(E186=\"\",\"\",E186),IF(H186=\"\",\"\",H186))","v":"(free of)"},{"$f":"IF($K$1=1,G186,D186)","v":"frei"}]
[null,"14-Household",{"$f":"IF(AND(LEFT(D187,1)=\"d\",MID(D187,4,1)=\" \"),RIGHT(D187,LEN(D187)-4),D187)","v":"Werkzeuge"},"die Werkzeuge",null,0,"tools",null,-3,{"$f":"RAND()","v":0.32258305765521955},{"$f":"IF(Table24[[#This Row],[Type Here]]=\"\",\"\",IF(Table24[[#This Row],[Type Here]]=Table24[[#This Row],[Answer]],1,-2))","v":""},{"$f":"IF($K$1=1,Table24[[#This Row],[Strength1]],Table24[[#This Row],[Strength2]])","v":-3},{"$f":"IF($K$1=1,D187,G187)","v":"tools"},null,{"$f":"IF($K$1=1,IF(E187=\"\",\"\",E187),IF(H187=\"\",\"\",H187))","v":""},{"$f":"IF($K$1=1,G187,D187)","v":"die Werkzeuge"}]
[null,"14-Household",{"$f":"IF(AND(LEFT(D188,1)=\"d\",MID(D188,4,1)=\" \"),RIGHT(D188,LEN(D188)-4),D188)","v":"Wohnort"},"der Wohnort",null,0,"domicile","(residence)",-2,{"$f":"RAND()","v":0.7522726925931561},{"$f":"IF(Table24[[#This Row],[Type Here]]=\"\",\"\",IF(Table24[[#This Row],[Type Here]]=Table24[[#This Row],[Answer]],1,-2))","v":""},{"$f":"IF($K$1=1,Table24[[#This Row],[Strength1]],Table24[[#This Row],[Strength2]])","v":-2},{"$f":"IF($K$1=1,D188,G188)","v":"domicile"},null,{"$f":"IF($K$1=1,IF(E188=\"\",\"\",E188),IF(H188=\"\",\"\",H188))","v":"(residence)"},{"$f":"IF($K$1=1,G188,D188)","v":"der Wohnort"}]
[null,"09-Clothing",{"$f":"IF(AND(LEFT(D189,1)=\"d\",MID(D189,4,1)=\" \"),RIGHT(D189,LEN(D189)-4),D189)","v":"Kleider"},"die Kleider",null,0,"dresses",null,1,{"$f":"RAND()","v":0.8669642332688275},{"$f":"IF(Table24[[#This Row],[Type Here]]=\"\",\"\",IF(Table24[[#This Row],[Type Here]]=Table24[[#This Row],[Answer]],1,-2))","v":""},{"$f":"IF($K$1=1,Table24[[#This Row],[Strength1]],Table24[[#This Row],[Strength2]])","v":1},{"$f":"IF($K$1=1,D189,G189)","v":"dresses"},null,{"$f":"IF($K$1=1,IF(E189=\"\",\"\",E189),IF(H189=\"\",\"\",H189))","v":""},{"$f":"IF($K$1=1,G189,D189)","v":"die Kleider"}]
[null,"14-Household",{"$f":"IF(AND(LEFT(D190,1)=\"d\",MID(D190,4,1)=\" \"),RIGHT(D190,LEN(D190)-4),D190)","v":"Reinigung"},"die Reinigung",null,0,"cleaning","noun",0,{"$f":"RAND()","v":0.07365063819836026},{"$f":"IF(Table24[[#This Row],[Type Here]]=\"\",\"\",IF(Table24[[#This Row],[Type Here]]=Table24[[#This Row],[Answer]],1,-2))","v":""},{"$f":"IF($K$1=1,Table24[[#This Row],[Strength1]],Table24[[#This Row],[Strength2]])","v":0},{"$f":"IF($K$1=1,D190,G190)","v":"cleaning"},null,{"$f":"IF($K$1=1,IF(E190=\"\",\"\",E190),IF(H190=\"\",\"\",H190))","v":"noun"},{"$f":"IF($K$1=1,G190,D190)","v":"die Reinigung"}]
[null,"12-Acc. Pron.",{"$f":"IF(AND(LEFT(D191,1)=\"d\",MID(D191,4,1)=\" \"),RIGHT(D191,LEN(D191)-4),D191)","v":"euch"},"euch",null,null,"you","(plural)",null,{"$f":"RAND()","v":0.2988362882365134},{"$f":"IF(Table24[[#This Row],[Type Here]]=\"\",\"\",IF(Table24[[#This Row],[Type Here]]=Table24[[#This Row],[Answer]],1,-2))","v":""},{"$f":"IF($K$1=1,Table24[[#This Row],[Strength1]],Table24[[#This Row],[Strength2]])","v":0},{"$f":"IF($K$1=1,D191,G191)","v":"you"},null,{"$f":"IF($K$1=1,IF(E191=\"\",\"\",E191),IF(H191=\"\",\"\",H191))","v":"(plural)"},{"$f":"IF($K$1=1,G191,D191)","v":"euch"}]
[null,"14-Household",{"$f":"IF(AND(LEFT(D192,1)=\"d\",MID(D192,4,1)=\" \"),RIGHT(D192,LEN(D192)-4),D192)","v":"Löffel"},"der Löffel",null,0,"spoon",null,0,{"$f":"RAND()","v":0.4187076584106335},{"$f":"IF(Table24[[#This Row],[Type Here]]=\"\",\"\",IF(Table24[[#This Row],[Type Here]]=Table24[[#This Row],[Answer]],1,-2))","v":""},{"$f":"IF($K$1=1,Table24[[#This Row],[Strength1]],Table24[[#This Row],[Strength2]])","v":0},{"$f":"IF($K$1=1,D192,G192)","v":"spoon"},null,{"$f":"IF($K$1=1,IF(E192=\"\",\"\",E192),IF(H192=\"\",\"\",H192))","v":""},{"$f":"IF($K$1=1,G192,D192)","v":"der Löffel"}]
[null,"08-V. Pres. 1",{"$f":"IF(AND(LEFT(D193,1)=\"d\",MID(D193,4,1)=\" \"),RIGHT(D193,LEN(D193)-4),D193)","v":"laufen"},"laufen",null,0,"to walk","(or to run; often slower than rennen; to function)",0,{"$f":"RAND()","v":0.5940826243606936},{"$f":"IF(Table24[[#This Row],[Type Here]]=\"\",\"\",IF(Table24[[#This Row],[Type Here]]=Table24[[#This Row],[Answer]],1,-2))","v":""},{"$f":"IF($K$1=1,Table24[[#This Row],[Strength1]],Table24[[#This Row],[Strength2]])","v":0},{"$f":"IF($K$1=1,D193,G193)","v":"to walk"},null,{"$f":"IF($K$1=1,IF(E193=\"\",\"\",E193),IF(H193=\"\",\"\",H193))","v":"(or to run; often slower than rennen; to function)"},{"$f":"IF($K$1=1,G193,D193)","v":"laufen"}]
[null,"29-Medical",{"$f":"IF(AND(LEFT(D194,1)=\"d\",MID(D194,4,1)=\" \"),RIGHT(D194,LEN(D194)-4),D194)","v":"Augen"},"die Augen",null,0,"eyes","noun",4,{"$f":"RAND()","v":0.2851810067736833},{"$f":"IF(Table24[[#This Row],[Type Here]]=\"\",\"\",IF(Table24[[#This Row],[Type Here]]=Table24[[#This Row],[Answer]],1,-2))","v":""},{"$f":"IF($K$1=1,Table24[[#This Row],[Strength1]],Table24[[#This Row],[Strength2]])","v":4},{"$f":"IF($K$1=1,D194,G194)","v":"eyes"},null,{"$f":"IF($K$1=1,IF(E194=\"\",\"\",E194),IF(H194=\"\",\"\",H194))","v":"noun"},{"$f":"IF($K$1=1,G194,D194)","v":"die Augen"}]
[null,"40-Places",{"$f":"IF(AND(LEFT(D195,1)=\"d\",MID(D195,4,1)=\" \"),RIGHT(D195,LEN(D195)-4),D195)","v":"Umgebung"},"die Umgebung",null,0,"surroundings","neighborhood",0,{"$f":"RAND()","v":0.5522386017248513},{"$f":"IF(Table24[[#This Row],[Type Here]]=\"\",\"\",IF(Table24[[#This Row],[Type Here]]=Table24[[#This Row],[Answer]],1,-2))","v":""},{"$f":"IF($K$1=1,Table24[[#This Row],[Strength1]],Table24[[#This Row],[Strength2]])","v":0},{"$f":"IF($K$1=1,D195,G195)","v":"surroundings"},null,{"$f":"IF($K$1=1,IF(E195=\"\",\"\",E195),IF(H195=\"\",\"\",H195))","v":"neighborhood"},{"$f":"IF($K$1=1,G195,D195)","v":"die Umgebung"}]
[null,"29-Medical",{"$f":"IF(AND(LEFT(D196,1)=\"d\",MID(D196,4,1)=\" \"),RIGHT(D196,LEN(D196)-4),D196)","v":"Geburt"},"die Geburt",null,0,"birth",null,5,{"$f":"RAND()","v":0.5361899083110735},{"$f":"IF(Table24[[#This Row],[Type Here]]=\"\",\"\",IF(Table24[[#This Row],[Type Here]]=Table24[[#This Row],[Answer]],1,-2))","v":""},{"$f":"IF($K$1=1,Table24[[#This Row],[Strength1]],Table24[[#This Row],[Strength2]])","v":5},{"$f":"IF($K$1=1,D196,G196)","v":"birth"},null,{"$f":"IF($K$1=1,IF(E196=\"\",\"\",E196),IF(H196=\"\",\"\",H196))","v":""},{"$f":"IF($K$1=1,G196,D196)","v":"die Geburt"}]
[null,"02-Basics 2",{"$f":"IF(AND(LEFT(D197,1)=\"d\",MID(D197,4,1)=\" \"),RIGHT(D197,LEN(D197)-4),D197)","v":"ihr habt"},"ihr habt",null,0,"you have","informal plural",0,{"$f":"RAND()","v":0.2330315739393264},{"$f":"IF(Table24[[#This Row],[Type Here]]=\"\",\"\",IF(Table24[[#This Row],[Type Here]]=Table24[[#This Row],[Answer]],1,-2))","v":""},{"$f":"IF($K$1=1,Table24[[#This Row],[Strength1]],Table24[[#This Row],[Strength2]])","v":0},{"$f":"IF($K$1=1,D197,G197)","v":"you have"},null,{"$f":"IF($K$1=1,IF(E197=\"\",\"\",E197),IF(H197=\"\",\"\",H197))","v":"informal plural"},{"$f":"IF($K$1=1,G197,D197)","v":"ihr habt"}]
[null,"11-Family",{"$f":"IF(AND(LEFT(D198,1)=\"d\",MID(D198,4,1)=\" \"),RIGHT(D198,LEN(D198)-4),D198)","v":"Partnerschaft"},"die Partnerschaft",null,null,"partnership",null,null,{"$f":"RAND()","v":0.13908362590788614},{"$f":"IF(Table24[[#This Row],[Type Here]]=\"\",\"\",IF(Table24[[#This Row],[Type Here]]=Table24[[#This Row],[Answer]],1,-2))","v":""},{"$f":"IF($K$1=1,Table24[[#This Row],[Strength1]],Table24[[#This Row],[Strength2]])","v":0},{"$f":"IF($K$1=1,D198,G198)","v":"partnership"},null,{"$f":"IF($K$1=1,IF(E198=\"\",\"\",E198),IF(H198=\"\",\"\",H198))","v":""},{"$f":"IF($K$1=1,G198,D198)","v":"die Partnerschaft"}]
[null,"12-Acc. Pron.",{"$f":"IF(AND(LEFT(D199,1)=\"d\",MID(D199,4,1)=\" \"),RIGHT(D199,LEN(D199)-4),D199)","v":"dies"},"dies",null,null,"these","(relative pronoun)",null,{"$f":"RAND()","v":0.0959501619265547},{"$f":"IF(Table24[[#This Row],[Type Here]]=\"\",\"\",IF(Table24[[#This Row],[Type Here]]=Table24[[#This Row],[Answer]],1,-2))","v":""},{"$f":"IF($K$1=1,Table24[[#This Row],[Strength1]],Table24[[#This Row],[Strength2]])","v":0},{"$f":"IF($K$1=1,D199,G199)","v":"these"},null,{"$f":"IF($K$1=1,IF(E199=\"\",\"\",E199),IF(H199=\"\",\"\",H199))","v":"(relative pronoun)"},{"$f":"IF($K$1=1,G199,D199)","v":"dies"}]
[null,"04-Food",{"$f":"IF(AND(LEFT(D200,1)=\"d\",MID(D200,4,1)=\" \"),RIGHT(D200,LEN(D200)-4),D200)","v":"Zitronen"},"die Zitronen",null,0,"lemons",null,2,{"$f":"RAND()","v":0.7999572893983167},{"$f":"IF(Table24[[#This Row],[Type Here]]=\"\",\"\",IF(Table24[[#This Row],[Type Here]]=Table24[[#This Row],[Answer]],1,-2))","v":""},{"$f":"IF($K$1=1,Table24[[#This Row],[Strength1]],Table24[[#This Row],[Strength2]])","v":2},{"$f":"IF($K$1=1,D200,G200)","v":"lemons"},null,{"$f":"IF($K$1=1,IF(E200=\"\",\"\",E200),IF(H200=\"\",\"\",H200))","v":""},{"$f":"IF($K$1=1,G200,D200)","v":"die Zitronen"}]
[null,"29-Medical",{"$f":"IF(AND(LEFT(D201,1)=\"d\",MID(D201,4,1)=\" \"),RIGHT(D201,LEN(D201)-4),D201)","v":"Formular"},"das Formular",null,0,"form","sth to fill out",-2,{"$f":"RAND()","v":0.3420002436924875},{"$f":"IF(Table24[[#This Row],[Type Here]]=\"\",\"\",IF(Table24[[#This Row],[Type Here]]=Table24[[#This Row],[Answer]],1,-2))","v":""},{"$f":"IF($K$1=1,Table24[[#This Row],[Strength1]],Table24[[#This Row],[Strength2]])","v":-2},{"$f":"IF($K$1=1,D201,G201)","v":"form"},null,{"$f":"IF($K$1=1,IF(E201=\"\",\"\",E201),IF(H201=\"\",\"\",H201))","v":"sth to fill out"},{"$f":"IF($K$1=1,G201,D201)","v":"das Formular"}]
[null,"04-Food",{"$f":"IF(AND(LEFT(D202,1)=\"d\",MID(D202,4,1)=\" \"),RIGHT(D202,LEN(D202)-4),D202)","v":"Fisch"},"der Fisch",null,0,"fish","singular",0,{"$f":"RAND()","v":0.3468880498297148},{"$f":"IF(Table24[[#This Row],[Type Here]]=\"\",\"\",IF(Table24[[#This Row],[Type Here]]=Table24[[#This Row],[Answer]],1,-2))","v":""},{"$f":"IF($K$1=1,Table24[[#This Row],[Strength1]],Table24[[#This Row],[Strength2]])","v":0},{"$f":"IF($K$1=1,D202,G202)","v":"fish"},null,{"$f":"IF($K$1=1,IF(E202=\"\",\"\",E202),IF(H202=\"\",\"\",H202))","v":"singular"},{"$f":"IF($K$1=1,G202,D202)","v":"der Fisch"}]
[null,"04-Food",{"$f":"IF(AND(LEFT(D203,1)=\"d\",MID(D203,4,1)=\" \"),RIGHT(D203,LEN(D203)-4),D203)","v":"Abendessen"},"die Abendessen",null,0,"suppers",null,2,{"$f":"RAND()","v":0.4839710227406948},{"$f":"IF(Table24[[#This Row],[Type Here]]=\"\",\"\",IF(Table24[[#This Row],[Type Here]]=Table24[[#This Row],[Answer]],1,-2))","v":""},{"$f":"IF($K$1=1,Table24[[#This Row],[Strength1]],Table24[[#This Row],[Strength2]])","v":2},{"$f":"IF($K$1=1,D203,G203)","v":"suppers"},null,{"$f":"IF($K$1=1,IF(E203=\"\",\"\",E203),IF(H203=\"\",\"\",H203))","v":""},{"$f":"IF($K$1=1,G203,D203)","v":"die Abendessen"}]
[null,"03-Phrases",{"$f":"IF(AND(LEFT(D204,1)=\"d\",MID(D204,4,1)=\" \"),RIGHT(D204,LEN(D204)-4),D204)","v":"nein"},"nein",null,0,"no",null,2,{"$f":"RAND()","v":0.9429757077360137},{"$f":"IF(Table24[[#This Row],[Type Here]]=\"\",\"\",IF(Table24[[#This Row],[Type Here]]=Table24[[#This Row],[Answer]],1,-2))","v":""},{"$f":"IF($K$1=1,Table24[[#This Row],[Strength1]],Table24[[#This Row],[Strength2]])","v":2},{"$f":"IF($K$1=1,D204,G204)","v":"no"},null,{"$f":"IF($K$1=1,IF(E204=\"\",\"\",E204),IF(H204=\"\",\"\",H204))","v":""},{"$f":"IF($K$1=1,G204,D204)","v":"nein"}]
[null,"05-Animals",{"$f":"IF(AND(LEFT(D205,1)=\"d\",MID(D205,4,1)=\" \"),RIGHT(D205,LEN(D205)-4),D205)","v":"Bienen"},"die Bienen",null,0,"bees",null,1,{"$f":"RAND()","v":0.021308738084818812},{"$f":"IF(Table24[[#This Row],[Type Here]]=\"\",\"\",IF(Table24[[#This Row],[Type Here]]=Table24[[#This Row],[Answer]],1,-2))","v":""},{"$f":"IF($K$1=1,Table24[[#This Row],[Strength1]],Table24[[#This Row],[Strength2]])","v":1},{"$f":"IF($K$1=1,D205,G205)","v":"bees"},null,{"$f":"IF($K$1=1,IF(E205=\"\",\"\",E205),IF(H205=\"\",\"\",H205))","v":""},{"$f":"IF($K$1=1,G205,D205)","v":"die Bienen"}]
[null,"04-Food",{"$f":"IF(AND(LEFT(D206,1)=\"d\",MID(D206,4,1)=\" \"),RIGHT(D206,LEN(D206)-4),D206)","v":"Orange"},"die Orange",null,0,"orange",null,3,{"$f":"RAND()","v":0.5769527492386237},{"$f":"IF(Table24[[#This Row],[Type Here]]=\"\",\"\",IF(Table24[[#This Row],[Type Here]]=Table24[[#This Row],[Answer]],1,-2))","v":""},{"$f":"IF($K$1=1,Table24[[#This Row],[Strength1]],Table24[[#This Row],[Strength2]])","v":3},{"$f":"IF($K$1=1,D206,G206)","v":"orange"},null,{"$f":"IF($K$1=1,IF(E206=\"\",\"\",E206),IF(H206=\"\",\"\",H206))","v":""},{"$f":"IF($K$1=1,G206,D206)","v":"die Orange"}]
[null,"14-Household",{"$f":"IF(AND(LEFT(D207,1)=\"d\",MID(D207,4,1)=\" \"),RIGHT(D207,LEN(D207)-4),D207)","v":"Umzug"},"der Umzug",null,0,"move","noun (relocation, procession)",-2,{"$f":"RAND()","v":0.30439141365616673},{"$f":"IF(Table24[[#This Row],[Type Here]]=\"\",\"\",IF(Table24[[#This Row],[Type Here]]=Table24[[#This Row],[Answer]],1,-2))","v":""},{"$f":"IF($K$1=1,Table24[[#This Row],[Strength1]],Table24[[#This Row],[Strength2]])","v":-2},{"$f":"IF($K$1=1,D207,G207)","v":"move"},null,{"$f":"IF($K$1=1,IF(E207=\"\",\"\",E207),IF(H207=\"\",\"\",H207))","v":"noun (relocation, procession)"},{"$f":"IF($K$1=1,G207,D207)","v":"der Umzug"}]
[null,"29-Medical",{"$f":"IF(AND(LEFT(D208,1)=\"d\",MID(D208,4,1)=\" \"),RIGHT(D208,LEN(D208)-4),D208)","v":"Krankenversicherung"},"die Krankenversicherung",null,0,"health insurance",null,0,{"$f":"RAND()","v":0.011033669230852916},{"$f":"IF(Table24[[#This Row],[Type Here]]=\"\",\"\",IF(Table24[[#This Row],[Type Here]]=Table24[[#This Row],[Answer]],1,-2))","v":""},{"$f":"IF($K$1=1,Table24[[#This Row],[Strength1]],Table24[[#This Row],[Strength2]])","v":0},{"$f":"IF($K$1=1,D208,G208)","v":"health insurance"},null,{"$f":"IF($K$1=1,IF(E208=\"\",\"\",E208),IF(H208=\"\",\"\",H208))","v":""},{"$f":"IF($K$1=1,G208,D208)","v":"die Krankenversicherung"}]
[null,"03-Phrases",{"$f":"IF(AND(LEFT(D209,1)=\"d\",MID(D209,4,1)=\" \"),RIGHT(D209,LEN(D209)-4),D209)","v":"Entschuldigung"},"die Entschuldigung",null,0,"apology",null,1,{"$f":"RAND()","v":0.7450270423291593},{"$f":"IF(Table24[[#This Row],[Type Here]]=\"\",\"\",IF(Table24[[#This Row],[Type Here]]=Table24[[#This Row],[Answer]],1,-2))","v":""},{"$f":"IF($K$1=1,Table24[[#This Row],[Strength1]],Table24[[#This Row],[Strength2]])","v":1},{"$f":"IF($K$1=1,D209,G209)","v":"apology"},null,{"$f":"IF($K$1=1,IF(E209=\"\",\"\",E209),IF(H209=\"\",\"\",H209))","v":""},{"$f":"IF($K$1=1,G209,D209)","v":"die Entschuldigung"}]
[null,"03-Phrases",{"$f":"IF(AND(LEFT(D210,1)=\"d\",MID(D210,4,1)=\" \"),RIGHT(D210,LEN(D210)-4),D210)","v":"Wiedersehen"},"das Wiedersehen",null,0,"reunion",null,1,{"$f":"RAND()","v":0.15761991608529236},{"$f":"IF(Table24[[#This Row],[Type Here]]=\"\",\"\",IF(Table24[[#This Row],[Type Here]]=Table24[[#This Row],[Answer]],1,-2))","v":""},{"$f":"IF($K$1=1,Table24[[#This Row],[Strength1]],Table24[[#This Row],[Strength2]])","v":1},{"$f":"IF($K$1=1,D210,G210)","v":"reunion"},null,{"$f":"IF($K$1=1,IF(E210=\"\",\"\",E210),IF(H210=\"\",\"\",H210))","v":""},{"$f":"IF($K$1=1,G210,D210)","v":"das Wiedersehen"}]
[null,"04-Food",{"$f":"IF(AND(LEFT(D211,1)=\"d\",MID(D211,4,1)=\" \"),RIGHT(D211,LEN(D211)-4),D211)","v":"Speisekarten"},"die Speisekarten",null,0,"menus","bills of fair",3,{"$f":"RAND()","v":0.4156803390955428},{"$f":"IF(Table24[[#This Row],[Type Here]]=\"\",\"\",IF(Table24[[#This Row],[Type Here]]=Table24[[#This Row],[Answer]],1,-2))","v":""},{"$f":"IF($K$1=1,Table24[[#This Row],[Strength1]],Table24[[#This Row],[Strength2]])","v":3},{"$f":"IF($K$1=1,D211,G211)","v":"menus"},null,{"$f":"IF($K$1=1,IF(E211=\"\",\"\",E211),IF(H211=\"\",\"\",H211))","v":"bills of fair"},{"$f":"IF($K$1=1,G211,D211)","v":"die Speisekarten"}]
[null,"29-Medical",{"$f":"IF(AND(LEFT(D212,1)=\"d\",MID(D212,4,1)=\" \"),RIGHT(D212,LEN(D212)-4),D212)","v":"Unfälle"},"die Unfälle",null,0,"accidents",null,4,{"$f":"RAND()","v":0.6504821669147852},{"$f":"IF(Table24[[#This Row],[Type Here]]=\"\",\"\",IF(Table24[[#This Row],[Type Here]]=Table24[[#This Row],[Answer]],1,-2))","v":""},{"$f":"IF($K$1=1,Table24[[#This Row],[Strength1]],Table24[[#This Row],[Strength2]])","v":4},{"$f":"IF($K$1=1,D212,G212)","v":"accidents"},null,{"$f":"IF($K$1=1,IF(E212=\"\",\"\",E212),IF(H212=\"\",\"\",H212))","v":""},{"$f":"IF($K$1=1,G212,D212)","v":"die Unfälle"}]
[null,"07-Adjectives",{"$f":"IF(AND(LEFT(D213,1)=\"d\",MID(D213,4,1)=\" \"),RIGHT(D213,LEN(D213)-4),D213)","v":"einfach"},"einfach",null,0,"simple",null,0,{"$f":"RAND()","v":0.7730201025059773},{"$f":"IF(Table24[[#This Row],[Type Here]]=\"\",\"\",IF(Table24[[#This Row],[Type Here]]=Table24[[#This Row],[Answer]],1,-2))","v":""},{"$f":"IF($K$1=1,Table24[[#This Row],[Strength1]],Table24[[#This Row],[Strength2]])","v":0},{"$f":"IF($K$1=1,D213,G213)","v":"simple"},null,{"$f":"IF($K$1=1,IF(E213=\"\",\"\",E213),IF(H213=\"\",\"\",H213))","v":""},{"$f":"IF($K$1=1,G213,D213)","v":"einfach"}]
[null,"02-Basics 2",{"$f":"IF(AND(LEFT(D214,1)=\"d\",MID(D214,4,1)=\" \"),RIGHT(D214,LEN(D214)-4),D214)","v":"sie essen"},"sie essen",null,0,"they eat",null,2,{"$f":"RAND()","v":0.13116582463853077},{"$f":"IF(Table24[[#This Row],[Type Here]]=\"\",\"\",IF(Table24[[#This Row],[Type Here]]=Table24[[#This Row],[Answer]],1,-2))","v":""},{"$f":"IF($K$1=1,Table24[[#This Row],[Strength1]],Table24[[#This Row],[Strength2]])","v":2},{"$f":"IF($K$1=1,D214,G214)","v":"they eat"},null,{"$f":"IF($K$1=1,IF(E214=\"\",\"\",E214),IF(H214=\"\",\"\",H214))","v":""},{"$f":"IF($K$1=1,G214,D214)","v":"sie essen"}]
[null,"04-Food",{"$f":"IF(AND(LEFT(D215,1)=\"d\",MID(D215,4,1)=\" \"),RIGHT(D215,LEN(D215)-4),D215)","v":"Vegetarier"},"der Vegetarier",null,0,"vegetarian","male singular",2,{"$f":"RAND()","v":0.5594927142899946},{"$f":"IF(Table24[[#This Row],[Type Here]]=\"\",\"\",IF(Table24[[#This Row],[Type Here]]=Table24[[#This Row],[Answer]],1,-2))","v":""},{"$f":"IF($K$1=1,Table24[[#This Row],[Strength1]],Table24[[#This Row],[Strength2]])","v":2},{"$f":"IF($K$1=1,D215,G215)","v":"vegetarian"},null,{"$f":"IF($K$1=1,IF(E215=\"\",\"\",E215),IF(H215=\"\",\"\",H215))","v":"male singular"},{"$f":"IF($K$1=1,G215,D215)","v":"der Vegetarier"}]
[null,"29-Medical",{"$f":"IF(AND(LEFT(D216,1)=\"d\",MID(D216,4,1)=\" \"),RIGHT(D216,LEN(D216)-4),D216)","v":"Formulare"},"die Formulare",null,0,"forms","sth to fill out",2,{"$f":"RAND()","v":0.8175718483261338},{"$f":"IF(Table24[[#This Row],[Type Here]]=\"\",\"\",IF(Table24[[#This Row],[Type Here]]=Table24[[#This Row],[Answer]],1,-2))","v":""},{"$f":"IF($K$1=1,Table24[[#This Row],[Strength1]],Table24[[#This Row],[Strength2]])","v":2},{"$f":"IF($K$1=1,D216,G216)","v":"forms"},null,{"$f":"IF($K$1=1,IF(E216=\"\",\"\",E216),IF(H216=\"\",\"\",H216))","v":"sth to fill out"},{"$f":"IF($K$1=1,G216,D216)","v":"die Formulare"}]
[null,"04-Food",{"$f":"IF(AND(LEFT(D217,1)=\"d\",MID(D217,4,1)=\" \"),RIGHT(D217,LEN(D217)-4),D217)","v":"Apfelsaft"},"der Apfelsaft",null,0,"apple juice",null,3,{"$f":"RAND()","v":0.4894117514294807},{"$f":"IF(Table24[[#This Row],[Type Here]]=\"\",\"\",IF(Table24[[#This Row],[Type Here]]=Table24[[#This Row],[Answer]],1,-2))","v":""},{"$f":"IF($K$1=1,Table24[[#This Row],[Strength1]],Table24[[#This Row],[Strength2]])","v":3},{"$f":"IF($K$1=1,D217,G217)","v":"apple juice"},null,{"$f":"IF($K$1=1,IF(E217=\"\",\"\",E217),IF(H217=\"\",\"\",H217))","v":""},{"$f":"IF($K$1=1,G217,D217)","v":"der Apfelsaft"}]
[null,"40-Places",{"$f":"IF(AND(LEFT(D218,1)=\"d\",MID(D218,4,1)=\" \"),RIGHT(D218,LEN(D218)-4),D218)","v":"Flächen"},"die Flächen",null,0,"areas","(surface areas, like sq feet)",2,{"$f":"RAND()","v":0.10091086014757533},{"$f":"IF(Table24[[#This Row],[Type Here]]=\"\",\"\",IF(Table24[[#This Row],[Type Here]]=Table24[[#This Row],[Answer]],1,-2))","v":""},{"$f":"IF($K$1=1,Table24[[#This Row],[Strength1]],Table24[[#This Row],[Strength2]])","v":2},{"$f":"IF($K$1=1,D218,G218)","v":"areas"},null,{"$f":"IF($K$1=1,IF(E218=\"\",\"\",E218),IF(H218=\"\",\"\",H218))","v":"(surface areas, like sq feet)"},{"$f":"IF($K$1=1,G218,D218)","v":"die Flächen"}]
[null,"14-Household",{"$f":"IF(AND(LEFT(D219,1)=\"d\",MID(D219,4,1)=\" \"),RIGHT(D219,LEN(D219)-4),D219)","v":"Zahnpasta"},"die Zahnpasta",null,0,"tooth paste",null,0,{"$f":"RAND()","v":0.15112755447910642},{"$f":"IF(Table24[[#This Row],[Type Here]]=\"\",\"\",IF(Table24[[#This Row],[Type Here]]=Table24[[#This Row],[Answer]],1,-2))","v":""},{"$f":"IF($K$1=1,Table24[[#This Row],[Strength1]],Table24[[#This Row],[Strength2]])","v":0},{"$f":"IF($K$1=1,D219,G219)","v":"tooth paste"},null,{"$f":"IF($K$1=1,IF(E219=\"\",\"\",E219),IF(H219=\"\",\"\",H219))","v":""},{"$f":"IF($K$1=1,G219,D219)","v":"die Zahnpasta"}]
[null,"09-Clothing",{"$f":"IF(AND(LEFT(D220,1)=\"d\",MID(D220,4,1)=\" \"),RIGHT(D220,LEN(D220)-4),D220)","v":"Hut"},"der Hut",null,0,"hat ",null,1,{"$f":"RAND()","v":0.48795622502332425},{"$f":"IF(Table24[[#This Row],[Type Here]]=\"\",\"\",IF(Table24[[#This Row],[Type Here]]=Table24[[#This Row],[Answer]],1,-2))","v":""},{"$f":"IF($K$1=1,Table24[[#This Row],[Strength1]],Table24[[#This Row],[Strength2]])","v":1},{"$f":"IF($K$1=1,D220,G220)","v":"hat "},null,{"$f":"IF($K$1=1,IF(E220=\"\",\"\",E220),IF(H220=\"\",\"\",H220))","v":""},{"$f":"IF($K$1=1,G220,D220)","v":"der Hut"}]
[null,"03-Phrases",{"$f":"IF(AND(LEFT(D221,1)=\"d\",MID(D221,4,1)=\" \"),RIGHT(D221,LEN(D221)-4),D221)","v":"tschüss"},"tschüss",null,0,"Bye","(informal)",1,{"$f":"RAND()","v":0.280144957978935},{"$f":"IF(Table24[[#This Row],[Type Here]]=\"\",\"\",IF(Table24[[#This Row],[Type Here]]=Table24[[#This Row],[Answer]],1,-2))","v":""},{"$f":"IF($K$1=1,Table24[[#This Row],[Strength1]],Table24[[#This Row],[Strength2]])","v":1},{"$f":"IF($K$1=1,D221,G221)","v":"Bye"},null,{"$f":"IF($K$1=1,IF(E221=\"\",\"\",E221),IF(H221=\"\",\"\",H221))","v":"(informal)"},{"$f":"IF($K$1=1,G221,D221)","v":"tschüss"}]
[null,"10-Nom. Pron.",{"$f":"IF(AND(LEFT(D222,1)=\"d\",MID(D222,4,1)=\" \"),RIGHT(D222,LEN(D222)-4),D222)","v":"viel"},"viel",null,0,"many",null,1,{"$f":"RAND()","v":0.23714952583760973},{"$f":"IF(Table24[[#This Row],[Type Here]]=\"\",\"\",IF(Table24[[#This Row],[Type Here]]=Table24[[#This Row],[Answer]],1,-2))","v":""},{"$f":"IF($K$1=1,Table24[[#This Row],[Strength1]],Table24[[#This Row],[Strength2]])","v":1},{"$f":"IF($K$1=1,D222,G222)","v":"many"},null,{"$f":"IF($K$1=1,IF(E222=\"\",\"\",E222),IF(H222=\"\",\"\",H222))","v":""},{"$f":"IF($K$1=1,G222,D222)","v":"viel"}]
[null,"14-Household",{"$f":"IF(AND(LEFT(D223,1)=\"d\",MID(D223,4,1)=\" \"),RIGHT(D223,LEN(D223)-4),D223)","v":"Fenster"},"das Fenster",null,0,"window",null,3,{"$f":"RAND()","v":0.6227780285944765},{"$f":"IF(Table24[[#This Row],[Type Here]]=\"\",\"\",IF(Table24[[#This Row],[Type Here]]=Table24[[#This Row],[Answer]],1,-2))","v":""},{"$f":"IF($K$1=1,Table24[[#This Row],[Strength1]],Table24[[#This Row],[Strength2]])","v":3},{"$f":"IF($K$1=1,D223,G223)","v":"window"},null,{"$f":"IF($K$1=1,IF(E223=\"\",\"\",E223),IF(H223=\"\",\"\",H223))","v":""},{"$f":"IF($K$1=1,G223,D223)","v":"das Fenster"}]
[null,"36-Nature",{"$f":"IF(AND(LEFT(D224,1)=\"d\",MID(D224,4,1)=\" \"),RIGHT(D224,LEN(D224)-4),D224)","v":"Wälder"},"die Wälder",null,0,"forests",null,3,{"$f":"RAND()","v":0.27774734849735505},{"$f":"IF(Table24[[#This Row],[Type Here]]=\"\",\"\",IF(Table24[[#This Row],[Type Here]]=Table24[[#This Row],[Answer]],1,-2))","v":""},{"$f":"IF($K$1=1,Table24[[#This Row],[Strength1]],Table24[[#This Row],[Strength2]])","v":3},{"$f":"IF($K$1=1,D224,G224)","v":"forests"},null,{"$f":"IF($K$1=1,IF(E224=\"\",\"\",E224),IF(H224=\"\",\"\",H224))","v":""},{"$f":"IF($K$1=1,G224,D224)","v":"die Wälder"}]
[null,"14-Household",{"$f":"IF(AND(LEFT(D225,1)=\"d\",MID(D225,4,1)=\" \"),RIGHT(D225,LEN(D225)-4),D225)","v":"Schüssel"},"die Schüssel",null,0,"bowl",null,0,{"$f":"RAND()","v":0.2715386301004682},{"$f":"IF(Table24[[#This Row],[Type Here]]=\"\",\"\",IF(Table24[[#This Row],[Type Here]]=Table24[[#This Row],[Answer]],1,-2))","v":""},{"$f":"IF($K$1=1,Table24[[#This Row],[Strength1]],Table24[[#This Row],[Strength2]])","v":0},{"$f":"IF($K$1=1,D225,G225)","v":"bowl"},null,{"$f":"IF($K$1=1,IF(E225=\"\",\"\",E225),IF(H225=\"\",\"\",H225))","v":""},{"$f":"IF($K$1=1,G225,D225)","v":"die Schüssel"}]
[null,"33-Adverbs 1",{"$f":"IF(AND(LEFT(D226,1)=\"d\",MID(D226,4,1)=\" \"),RIGHT(D226,LEN(D226)-4),D226)","v":"ich laufe...weg"},"ich laufe...weg",null,0,"I run away",null,-2,{"$f":"RAND()","v":0.14407191110078488},{"$f":"IF(Table24[[#This Row],[Type Here]]=\"\",\"\",IF(Table24[[#This Row],[Type Here]]=Table24[[#This Row],[Answer]],1,-2))","v":""},{"$f":"IF($K$1=1,Table24[[#This Row],[Strength1]],Table24[[#This Row],[Strength2]])","v":-2},{"$f":"IF($K$1=1,D226,G226)","v":"I run away"},null,{"$f":"IF($K$1=1,IF(E226=\"\",\"\",E226),IF(H226=\"\",\"\",H226))","v":""},{"$f":"IF($K$1=1,G226,D226)","v":"ich laufe...weg"}]
[null,"11-Family",{"$f":"IF(AND(LEFT(D227,1)=\"d\",MID(D227,4,1)=\" \"),RIGHT(D227,LEN(D227)-4),D227)","v":"Geschwister"},"die Geschwister",null,null,"siblings",null,null,{"$f":"RAND()","v":0.37920589258886805},{"$f":"IF(Table24[[#This Row],[Type Here]]=\"\",\"\",IF(Table24[[#This Row],[Type Here]]=Table24[[#This Row],[Answer]],1,-2))","v":""},{"$f":"IF($K$1=1,Table24[[#This Row],[Strength1]],Table24[[#This Row],[Strength2]])","v":0},{"$f":"IF($K$1=1,D227,G227)","v":"siblings"},null,{"$f":"IF($K$1=1,IF(E227=\"\",\"\",E227),IF(H227=\"\",\"\",H227))","v":""},{"$f":"IF($K$1=1,G227,D227)","v":"die Geschwister"}]
[null,"11-Family",{"$f":"IF(AND(LEFT(D228,1)=\"d\",MID(D228,4,1)=\" \"),RIGHT(D228,LEN(D228)-4),D228)","v":"Partner"},"die Partner",null,null,"partners",null,null,{"$f":"RAND()","v":0.4183730309080488},{"$f":"IF(Table24[[#This Row],[Type Here]]=\"\",\"\",IF(Table24[[#This Row],[Type Here]]=Table24[[#This Row],[Answer]],1,-2))","v":""},{"$f":"IF($K$1=1,Table24[[#This Row],[Strength1]],Table24[[#This Row],[Strength2]])","v":0},{"$f":"IF($K$1=1,D228,G228)","v":"partners"},null,{"$f":"IF($K$1=1,IF(E228=\"\",\"\",E228),IF(H228=\"\",\"\",H228))","v":""},{"$f":"IF($K$1=1,G228,D228)","v":"die Partner"}]
[null,"10-Nom. Pron.",{"$f":"IF(AND(LEFT(D229,1)=\"d\",MID(D229,4,1)=\" \"),RIGHT(D229,LEN(D229)-4),D229)","v":"jede"},"jede",null,0,"every",null,1,{"$f":"RAND()","v":0.5984525663829531},{"$f":"IF(Table24[[#This Row],[Type Here]]=\"\",\"\",IF(Table24[[#This Row],[Type Here]]=Table24[[#This Row],[Answer]],1,-2))","v":""},{"$f":"IF($K$1=1,Table24[[#This Row],[Strength1]],Table24[[#This Row],[Strength2]])","v":1},{"$f":"IF($K$1=1,D229,G229)","v":"every"},null,{"$f":"IF($K$1=1,IF(E229=\"\",\"\",E229),IF(H229=\"\",\"\",H229))","v":""},{"$f":"IF($K$1=1,G229,D229)","v":"jede"}]
[null,"11-Family",{"$f":"IF(AND(LEFT(D230,1)=\"d\",MID(D230,4,1)=\" \"),RIGHT(D230,LEN(D230)-4),D230)","v":"Sohn"},"der Sohn",null,null,"son",null,null,{"$f":"RAND()","v":0.08588234643205561},{"$f":"IF(Table24[[#This Row],[Type Here]]=\"\",\"\",IF(Table24[[#This Row],[Type Here]]=Table24[[#This Row],[Answer]],1,-2))","v":""},{"$f":"IF($K$1=1,Table24[[#This Row],[Strength1]],Table24[[#This Row],[Strength2]])","v":0},{"$f":"IF($K$1=1,D230,G230)","v":"son"},null,{"$f":"IF($K$1=1,IF(E230=\"\",\"\",E230),IF(H230=\"\",\"\",H230))","v":""},{"$f":"IF($K$1=1,G230,D230)","v":"der Sohn"}]
[null,"40-Places",{"$f":"IF(AND(LEFT(D231,1)=\"d\",MID(D231,4,1)=\" \"),RIGHT(D231,LEN(D231)-4),D231)","v":"Innere"},"das Innere",null,0,"interior","noun",-2,{"$f":"RAND()","v":0.7132583156283396},{"$f":"IF(Table24[[#This Row],[Type Here]]=\"\",\"\",IF(Table24[[#This Row],[Type Here]]=Table24[[#This Row],[Answer]],1,-2))","v":""},{"$f":"IF($K$1=1,Table24[[#This Row],[Strength1]],Table24[[#This Row],[Strength2]])","v":-2},{"$f":"IF($K$1=1,D231,G231)","v":"interior"},null,{"$f":"IF($K$1=1,IF(E231=\"\",\"\",E231),IF(H231=\"\",\"\",H231))","v":"noun"},{"$f":"IF($K$1=1,G231,D231)","v":"das Innere"}]
[null,"40-Places",{"$f":"IF(AND(LEFT(D232,1)=\"d\",MID(D232,4,1)=\" \"),RIGHT(D232,LEN(D232)-4),D232)","v":"Zentren"},"die Zentren",null,0,"centers",null,-2,{"$f":"RAND()","v":0.14812865889239746},{"$f":"IF(Table24[[#This Row],[Type Here]]=\"\",\"\",IF(Table24[[#This Row],[Type Here]]=Table24[[#This Row],[Answer]],1,-2))","v":""},{"$f":"IF($K$1=1,Table24[[#This Row],[Strength1]],Table24[[#This Row],[Strength2]])","v":-2},{"$f":"IF($K$1=1,D232,G232)","v":"centers"},null,{"$f":"IF($K$1=1,IF(E232=\"\",\"\",E232),IF(H232=\"\",\"\",H232))","v":""},{"$f":"IF($K$1=1,G232,D232)","v":"die Zentren"}]
[null,"29-Medical",{"$f":"IF(AND(LEFT(D233,1)=\"d\",MID(D233,4,1)=\" \"),RIGHT(D233,LEN(D233)-4),D233)","v":"Pflege"},"die Pflege",null,0,"care","(ie medical care)",1,{"$f":"RAND()","v":0.7460767198736423},{"$f":"IF(Table24[[#This Row],[Type Here]]=\"\",\"\",IF(Table24[[#This Row],[Type Here]]=Table24[[#This Row],[Answer]],1,-2))","v":""},{"$f":"IF($K$1=1,Table24[[#This Row],[Strength1]],Table24[[#This Row],[Strength2]])","v":1},{"$f":"IF($K$1=1,D233,G233)","v":"care"},null,{"$f":"IF($K$1=1,IF(E233=\"\",\"\",E233),IF(H233=\"\",\"\",H233))","v":"(ie medical care)"},{"$f":"IF($K$1=1,G233,D233)","v":"die Pflege"}]
[null,"14-Household",{"$f":"IF(AND(LEFT(D234,1)=\"d\",MID(D234,4,1)=\" \"),RIGHT(D234,LEN(D234)-4),D234)","v":"Leiter"},"der Leiter",null,0,"leader","male",1,{"$f":"RAND()","v":0.3750006931164488},{"$f":"IF(Table24[[#This Row],[Type Here]]=\"\",\"\",IF(Table24[[#This Row],[Type Here]]=Table24[[#This Row],[Answer]],1,-2))","v":""},{"$f":"IF($K$1=1,Table24[[#This Row],[Strength1]],Table24[[#This Row],[Strength2]])","v":1},{"$f":"IF($K$1=1,D234,G234)","v":"leader"},null,{"$f":"IF($K$1=1,IF(E234=\"\",\"\",E234),IF(H234=\"\",\"\",H234))","v":"male"},{"$f":"IF($K$1=1,G234,D234)","v":"der Leiter"}]
[null,"33-Adverbs 1",{"$f":"IF(AND(LEFT(D235,1)=\"d\",MID(D235,4,1)=\" \"),RIGHT(D235,LEN(D235)-4),D235)","v":"dennoch"},"dennoch",null,0,"nevertheless",null,0,{"$f":"RAND()","v":0.48042713980887675},{"$f":"IF(Table24[[#This Row],[Type Here]]=\"\",\"\",IF(Table24[[#This Row],[Type Here]]=Table24[[#This Row],[Answer]],1,-2))","v":""},{"$f":"IF($K$1=1,Table24[[#This Row],[Strength1]],Table24[[#This Row],[Strength2]])","v":0},{"$f":"IF($K$1=1,D235,G235)","v":"nevertheless"},null,{"$f":"IF($K$1=1,IF(E235=\"\",\"\",E235),IF(H235=\"\",\"\",H235))","v":""},{"$f":"IF($K$1=1,G235,D235)","v":"dennoch"}]
[null,"04-Food",{"$f":"IF(AND(LEFT(D236,1)=\"d\",MID(D236,4,1)=\" \"),RIGHT(D236,LEN(D236)-4),D236)","v":"Menüs"},"die Menüs",null,0,"menus",null,3,{"$f":"RAND()","v":0.9407956589730054},{"$f":"IF(Table24[[#This Row],[Type Here]]=\"\",\"\",IF(Table24[[#This Row],[Type Here]]=Table24[[#This Row],[Answer]],1,-2))","v":""},{"$f":"IF($K$1=1,Table24[[#This Row],[Strength1]],Table24[[#This Row],[Strength2]])","v":3},{"$f":"IF($K$1=1,D236,G236)","v":"menus"},null,{"$f":"IF($K$1=1,IF(E236=\"\",\"\",E236),IF(H236=\"\",\"\",H236))","v":""},{"$f":"IF($K$1=1,G236,D236)","v":"die Menüs"}]
[null,"33-Adverbs 1",{"$f":"IF(AND(LEFT(D237,1)=\"d\",MID(D237,4,1)=\" \"),RIGHT(D237,LEN(D237)-4),D237)","v":"meistens"},"meistens",null,0,"mostly",null,0,{"$f":"RAND()","v":0.2918397750978874},{"$f":"IF(Table24[[#This Row],[Type Here]]=\"\",\"\",IF(Table24[[#This Row],[Type Here]]=Table24[[#This Row],[Answer]],1,-2))","v":""},{"$f":"IF($K$1=1,Table24[[#This Row],[Strength1]],Table24[[#This Row],[Strength2]])","v":0},{"$f":"IF($K$1=1,D237,G237)","v":"mostly"},null,{"$f":"IF($K$1=1,IF(E237=\"\",\"\",E237),IF(H237=\"\",\"\",H237))","v":""},{"$f":"IF($K$1=1,G237,D237)","v":"meistens"}]
[null,"01-Basics 1",{"$f":"IF(AND(LEFT(D238,1)=\"d\",MID(D238,4,1)=\" \"),RIGHT(D238,LEN(D238)-4),D238)","v":"Apfel"},"der Apfel",null,0,"apple",null,1,{"$f":"RAND()","v":0.6179239518778469},{"$f":"IF(Table24[[#This Row],[Type Here]]=\"\",\"\",IF(Table24[[#This Row],[Type Here]]=Table24[[#This Row],[Answer]],1,-2))","v":""},{"$f":"IF($K$1=1,Table24[[#This Row],[Strength1]],Table24[[#This Row],[Strength2]])","v":1},{"$f":"IF($K$1=1,D238,G238)","v":"apple"},null,{"$f":"IF($K$1=1,IF(E238=\"\",\"\",E238),IF(H238=\"\",\"\",H238))","v":""},{"$f":"IF($K$1=1,G238,D238)","v":"der Apfel"}]
[null,"14-Household",{"$f":"IF(AND(LEFT(D239,1)=\"d\",MID(D239,4,1)=\" \"),RIGHT(D239,LEN(D239)-4),D239)","v":"Schlüssel"},"der Schlüssel",null,0,"key",null,1,{"$f":"RAND()","v":0.0180340914190813},{"$f":"IF(Table24[[#This Row],[Type Here]]=\"\",\"\",IF(Table24[[#This Row],[Type Here]]=Table24[[#This Row],[Answer]],1,-2))","v":""},{"$f":"IF($K$1=1,Table24[[#This Row],[Strength1]],Table24[[#This Row],[Strength2]])","v":1},{"$f":"IF($K$1=1,D239,G239)","v":"key"},null,{"$f":"IF($K$1=1,IF(E239=\"\",\"\",E239),IF(H239=\"\",\"\",H239))","v":""},{"$f":"IF($K$1=1,G239,D239)","v":"der Schlüssel"}]
[null,"04-Food",{"$f":"IF(AND(LEFT(D240,1)=\"d\",MID(D240,4,1)=\" \"),RIGHT(D240,LEN(D240)-4),D240)","v":"Zitrone"},"die Zitrone",null,0,"lemon",null,3,{"$f":"RAND()","v":0.992934856429141},{"$f":"IF(Table24[[#This Row],[Type Here]]=\"\",\"\",IF(Table24[[#This Row],[Type Here]]=Table24[[#This Row],[Answer]],1,-2))","v":""},{"$f":"IF($K$1=1,Table24[[#This Row],[Strength1]],Table24[[#This Row],[Strength2]])","v":3},{"$f":"IF($K$1=1,D240,G240)","v":"lemon"},null,{"$f":"IF($K$1=1,IF(E240=\"\",\"\",E240),IF(H240=\"\",\"\",H240))","v":""},{"$f":"IF($K$1=1,G240,D240)","v":"die Zitrone"}]
[null,"40-Places",{"$f":"IF(AND(LEFT(D241,1)=\"d\",MID(D241,4,1)=\" \"),RIGHT(D241,LEN(D241)-4),D241)","v":"entlang"},"entlang",null,0,"along","(along side of)",4,{"$f":"RAND()","v":0.8880539966959238},{"$f":"IF(Table24[[#This Row],[Type Here]]=\"\",\"\",IF(Table24[[#This Row],[Type Here]]=Table24[[#This Row],[Answer]],1,-2))","v":""},{"$f":"IF($K$1=1,Table24[[#This Row],[Strength1]],Table24[[#This Row],[Strength2]])","v":4},{"$f":"IF($K$1=1,D241,G241)","v":"along"},null,{"$f":"IF($K$1=1,IF(E241=\"\",\"\",E241),IF(H241=\"\",\"\",H241))","v":"(along side of)"},{"$f":"IF($K$1=1,G241,D241)","v":"entlang"}]
[null,"38-Ad: Nom. 1",{"$f":"IF(AND(LEFT(D242,1)=\"d\",MID(D242,4,1)=\" \"),RIGHT(D242,LEN(D242)-4),D242)","v":"nächst"},"nächst",null,0,"next",null,3,{"$f":"RAND()","v":0.03376178973593269},{"$f":"IF(Table24[[#This Row],[Type Here]]=\"\",\"\",IF(Table24[[#This Row],[Type Here]]=Table24[[#This Row],[Answer]],1,-2))","v":""},{"$f":"IF($K$1=1,Table24[[#This Row],[Strength1]],Table24[[#This Row],[Strength2]])","v":3},{"$f":"IF($K$1=1,D242,G242)","v":"next"},null,{"$f":"IF($K$1=1,IF(E242=\"\",\"\",E242),IF(H242=\"\",\"\",H242))","v":""},{"$f":"IF($K$1=1,G242,D242)","v":"nächst"}]
[null,"03-Phrases",{"$f":"IF(AND(LEFT(D243,1)=\"d\",MID(D243,4,1)=\" \"),RIGHT(D243,LEN(D243)-4),D243)","v":"leid"},"leid",null,0,"sorry",null,1,{"$f":"RAND()","v":0.34320216047145014},{"$f":"IF(Table24[[#This Row],[Type Here]]=\"\",\"\",IF(Table24[[#This Row],[Type Here]]=Table24[[#This Row],[Answer]],1,-2))","v":""},{"$f":"IF($K$1=1,Table24[[#This Row],[Strength1]],Table24[[#This Row],[Strength2]])","v":1},{"$f":"IF($K$1=1,D243,G243)","v":"sorry"},null,{"$f":"IF($K$1=1,IF(E243=\"\",\"\",E243),IF(H243=\"\",\"\",H243))","v":""},{"$f":"IF($K$1=1,G243,D243)","v":"leid"}]
[null,"14-Household",{"$f":"IF(AND(LEFT(D244,1)=\"d\",MID(D244,4,1)=\" \"),RIGHT(D244,LEN(D244)-4),D244)","v":"Flasche"},"die Flasche",null,0,"bottle",null,2,{"$f":"RAND()","v":0.5373027306119248},{"$f":"IF(Table24[[#This Row],[Type Here]]=\"\",\"\",IF(Table24[[#This Row],[Type Here]]=Table24[[#This Row],[Answer]],1,-2))","v":""},{"$f":"IF($K$1=1,Table24[[#This Row],[Strength1]],Table24[[#This Row],[Strength2]])","v":2},{"$f":"IF($K$1=1,D244,G244)","v":"bottle"},null,{"$f":"IF($K$1=1,IF(E244=\"\",\"\",E244),IF(H244=\"\",\"\",H244))","v":""},{"$f":"IF($K$1=1,G244,D244)","v":"die Flasche"}]
[null,"14-Household",{"$f":"IF(AND(LEFT(D245,1)=\"d\",MID(D245,4,1)=\" \"),RIGHT(D245,LEN(D245)-4),D245)","v":"Häuser"},"die Häuser",null,0,"houses",null,2,{"$f":"RAND()","v":0.8432318686431493},{"$f":"IF(Table24[[#This Row],[Type Here]]=\"\",\"\",IF(Table24[[#This Row],[Type Here]]=Table24[[#This Row],[Answer]],1,-2))","v":""},{"$f":"IF($K$1=1,Table24[[#This Row],[Strength1]],Table24[[#This Row],[Strength2]])","v":2},{"$f":"IF($K$1=1,D245,G245)","v":"houses"},null,{"$f":"IF($K$1=1,IF(E245=\"\",\"\",E245),IF(H245=\"\",\"\",H245))","v":""},{"$f":"IF($K$1=1,G245,D245)","v":"die Häuser"}]
[null,"33-Adverbs 1",{"$f":"IF(AND(LEFT(D246,1)=\"d\",MID(D246,4,1)=\" \"),RIGHT(D246,LEN(D246)-4),D246)","v":"spätestens"},"spätestens",null,0,"at the latest",null,0,{"$f":"RAND()","v":0.04680868155213713},{"$f":"IF(Table24[[#This Row],[Type Here]]=\"\",\"\",IF(Table24[[#This Row],[Type Here]]=Table24[[#This Row],[Answer]],1,-2))","v":""},{"$f":"IF($K$1=1,Table24[[#This Row],[Strength1]],Table24[[#This Row],[Strength2]])","v":0},{"$f":"IF($K$1=1,D246,G246)","v":"at the latest"},null,{"$f":"IF($K$1=1,IF(E246=\"\",\"\",E246),IF(H246=\"\",\"\",H246))","v":""},{"$f":"IF($K$1=1,G246,D246)","v":"spätestens"}]
[null,"22-Colors",{"$f":"IF(AND(LEFT(D247,1)=\"d\",MID(D247,4,1)=\" \"),RIGHT(D247,LEN(D247)-4),D247)","v":"Farbe"},"die Farbe",null,0,"color","noun",1,{"$f":"RAND()","v":0.9961321260644606},{"$f":"IF(Table24[[#This Row],[Type Here]]=\"\",\"\",IF(Table24[[#This Row],[Type Here]]=Table24[[#This Row],[Answer]],1,-2))","v":""},{"$f":"IF($K$1=1,Table24[[#This Row],[Strength1]],Table24[[#This Row],[Strength2]])","v":1},{"$f":"IF($K$1=1,D247,G247)","v":"color"},null,{"$f":"IF($K$1=1,IF(E247=\"\",\"\",E247),IF(H247=\"\",\"\",H247))","v":"noun"},{"$f":"IF($K$1=1,G247,D247)","v":"die Farbe"}]
[null,"38-Ad: Nom. 1",{"$f":"IF(AND(LEFT(D248,1)=\"d\",MID(D248,4,1)=\" \"),RIGHT(D248,LEN(D248)-4),D248)","v":"besonder"},"besonder",null,0,"special","(particular)",3,{"$f":"RAND()","v":0.6393940580472908},{"$f":"IF(Table24[[#This Row],[Type Here]]=\"\",\"\",IF(Table24[[#This Row],[Type Here]]=Table24[[#This Row],[Answer]],1,-2))","v":""},{"$f":"IF($K$1=1,Table24[[#This Row],[Strength1]],Table24[[#This Row],[Strength2]])","v":3},{"$f":"IF($K$1=1,D248,G248)","v":"special"},null,{"$f":"IF($K$1=1,IF(E248=\"\",\"\",E248),IF(H248=\"\",\"\",H248))","v":"(particular)"},{"$f":"IF($K$1=1,G248,D248)","v":"besonder"}]
[null,"14-Household",{"$f":"IF(AND(LEFT(D249,1)=\"d\",MID(D249,4,1)=\" \"),RIGHT(D249,LEN(D249)-4),D249)","v":"Flaschen"},"die Flaschen",null,0,"bottles",null,1,{"$f":"RAND()","v":0.41586235774249225},{"$f":"IF(Table24[[#This Row],[Type Here]]=\"\",\"\",IF(Table24[[#This Row],[Type Here]]=Table24[[#This Row],[Answer]],1,-2))","v":""},{"$f":"IF($K$1=1,Table24[[#This Row],[Strength1]],Table24[[#This Row],[Strength2]])","v":1},{"$f":"IF($K$1=1,D249,G249)","v":"bottles"},null,{"$f":"IF($K$1=1,IF(E249=\"\",\"\",E249),IF(H249=\"\",\"\",H249))","v":""},{"$f":"IF($K$1=1,G249,D249)","v":"die Flaschen"}]
[null,"11-Family",{"$f":"IF(AND(LEFT(D250,1)=\"d\",MID(D250,4,1)=\" \"),RIGHT(D250,LEN(D250)-4),D250)","v":"Bruder"},"der Bruder",null,null,"brother",null,null,{"$f":"RAND()","v":0.9197965284856309},{"$f":"IF(Table24[[#This Row],[Type Here]]=\"\",\"\",IF(Table24[[#This Row],[Type Here]]=Table24[[#This Row],[Answer]],1,-2))","v":""},{"$f":"IF($K$1=1,Table24[[#This Row],[Strength1]],Table24[[#This Row],[Strength2]])","v":0},{"$f":"IF($K$1=1,D250,G250)","v":"brother"},null,{"$f":"IF($K$1=1,IF(E250=\"\",\"\",E250),IF(H250=\"\",\"\",H250))","v":""},{"$f":"IF($K$1=1,G250,D250)","v":"der Bruder"}]
[null,"14-Household",{"$f":"IF(AND(LEFT(D251,1)=\"d\",MID(D251,4,1)=\" \"),RIGHT(D251,LEN(D251)-4),D251)","v":"Wände"},"die Wände",null,0,"walls",null,1,{"$f":"RAND()","v":0.6821409893330921},{"$f":"IF(Table24[[#This Row],[Type Here]]=\"\",\"\",IF(Table24[[#This Row],[Type Here]]=Table24[[#This Row],[Answer]],1,-2))","v":""},{"$f":"IF($K$1=1,Table24[[#This Row],[Strength1]],Table24[[#This Row],[Strength2]])","v":1},{"$f":"IF($K$1=1,D251,G251)","v":"walls"},null,{"$f":"IF($K$1=1,IF(E251=\"\",\"\",E251),IF(H251=\"\",\"\",H251))","v":""},{"$f":"IF($K$1=1,G251,D251)","v":"die Wände"}]
[null,"06-Plurals",{"$f":"IF(AND(LEFT(D252,1)=\"d\",MID(D252,4,1)=\" \"),RIGHT(D252,LEN(D252)-4),D252)","v":"Mädchen"},"die Mädchen","(plural)",0,"girls",null,0,{"$f":"RAND()","v":0.8483320813110045},{"$f":"IF(Table24[[#This Row],[Type Here]]=\"\",\"\",IF(Table24[[#This Row],[Type Here]]=Table24[[#This Row],[Answer]],1,-2))","v":""},{"$f":"IF($K$1=1,Table24[[#This Row],[Strength1]],Table24[[#This Row],[Strength2]])","v":0},{"$f":"IF($K$1=1,D252,G252)","v":"girls"},null,{"$f":"IF($K$1=1,IF(E252=\"\",\"\",E252),IF(H252=\"\",\"\",H252))","v":""},{"$f":"IF($K$1=1,G252,D252)","v":"die Mädchen"}]
[null,"14-Household",{"$f":"IF(AND(LEFT(D253,1)=\"d\",MID(D253,4,1)=\" \"),RIGHT(D253,LEN(D253)-4),D253)","v":"Umzüge"},"die Umzüge",null,0,"moves","noun (relocations, processions)",-2,{"$f":"RAND()","v":0.2268108440676122},{"$f":"IF(Table24[[#This Row],[Type Here]]=\"\",\"\",IF(Table24[[#This Row],[Type Here]]=Table24[[#This Row],[Answer]],1,-2))","v":""},{"$f":"IF($K$1=1,Table24[[#This Row],[Strength1]],Table24[[#This Row],[Strength2]])","v":-2},{"$f":"IF($K$1=1,D253,G253)","v":"moves"},null,{"$f":"IF($K$1=1,IF(E253=\"\",\"\",E253),IF(H253=\"\",\"\",H253))","v":"noun (relocations, processions)"},{"$f":"IF($K$1=1,G253,D253)","v":"die Umzüge"}]
[null,"14-Household",{"$f":"IF(AND(LEFT(D254,1)=\"d\",MID(D254,4,1)=\" \"),RIGHT(D254,LEN(D254)-4),D254)","v":"Zahnpastas"},"die Zahnpastas",null,0,"tooth pastes",null,-2,{"$f":"RAND()","v":0.047376171563344394},{"$f":"IF(Table24[[#This Row],[Type Here]]=\"\",\"\",IF(Table24[[#This Row],[Type Here]]=Table24[[#This Row],[Answer]],1,-2))","v":""},{"$f":"IF($K$1=1,Table24[[#This Row],[Strength1]],Table24[[#This Row],[Strength2]])","v":-2},{"$f":"IF($K$1=1,D254,G254)","v":"tooth pastes"},null,{"$f":"IF($K$1=1,IF(E254=\"\",\"\",E254),IF(H254=\"\",\"\",H254))","v":""},{"$f":"IF($K$1=1,G254,D254)","v":"die Zahnpastas"}]
[null,"01-Basics 1",{"$f":"IF(AND(LEFT(D255,1)=\"d\",MID(D255,4,1)=\" \"),RIGHT(D255,LEN(D255)-4),D255)","v":"der"},"der","(article - Dat fem)",0,"the","Dat fem",0,{"$f":"RAND()","v":0.7289369921259027},{"$f":"IF(Table24[[#This Row],[Type Here]]=\"\",\"\",IF(Table24[[#This Row],[Type Here]]=Table24[[#This Row],[Answer]],1,-2))","v":""},{"$f":"IF($K$1=1,Table24[[#This Row],[Strength1]],Table24[[#This Row],[Strength2]])","v":0},{"$f":"IF($K$1=1,D255,G255)","v":"the"},null,{"$f":"IF($K$1=1,IF(E255=\"\",\"\",E255),IF(H255=\"\",\"\",H255))","v":"Dat fem"},{"$f":"IF($K$1=1,G255,D255)","v":"der"}]
[null,"06-Plurals",{"$f":"IF(AND(LEFT(D256,1)=\"d\",MID(D256,4,1)=\" \"),RIGHT(D256,LEN(D256)-4),D256)","v":"Fische"},"die Fische",null,0,"fish","plural",1,{"$f":"RAND()","v":0.24660038176455013},{"$f":"IF(Table24[[#This Row],[Type Here]]=\"\",\"\",IF(Table24[[#This Row],[Type Here]]=Table24[[#This Row],[Answer]],1,-2))","v":""},{"$f":"IF($K$1=1,Table24[[#This Row],[Strength1]],Table24[[#This Row],[Strength2]])","v":1},{"$f":"IF($K$1=1,D256,G256)","v":"fish"},null,{"$f":"IF($K$1=1,IF(E256=\"\",\"\",E256),IF(H256=\"\",\"\",H256))","v":"plural"},{"$f":"IF($K$1=1,G256,D256)","v":"die Fische"}]
[null,"40-Places",{"$f":"IF(AND(LEFT(D257,1)=\"d\",MID(D257,4,1)=\" \"),RIGHT(D257,LEN(D257)-4),D257)","v":"Ferienhaus"},"das Ferienhaus",null,0,"vacation home",null,4,{"$f":"RAND()","v":0.5155552505505273},{"$f":"IF(Table24[[#This Row],[Type Here]]=\"\",\"\",IF(Table24[[#This Row],[Type Here]]=Table24[[#This Row],[Answer]],1,-2))","v":""},{"$f":"IF($K$1=1,Table24[[#This Row],[Strength1]],Table24[[#This Row],[Strength2]])","v":4},{"$f":"IF($K$1=1,D257,G257)","v":"vacation home"},null,{"$f":"IF($K$1=1,IF(E257=\"\",\"\",E257),IF(H257=\"\",\"\",H257))","v":""},{"$f":"IF($K$1=1,G257,D257)","v":"das Ferienhaus"}]
[null,"40-Places",{"$f":"IF(AND(LEFT(D258,1)=\"d\",MID(D258,4,1)=\" \"),RIGHT(D258,LEN(D258)-4),D258)","v":"Standort"},"der Standort",null,0,"position","location",-5,{"$f":"RAND()","v":0.20963817564391996},{"$f":"IF(Table24[[#This Row],[Type Here]]=\"\",\"\",IF(Table24[[#This Row],[Type Here]]=Table24[[#This Row],[Answer]],1,-2))","v":""},{"$f":"IF($K$1=1,Table24[[#This Row],[Strength1]],Table24[[#This Row],[Strength2]])","v":-5},{"$f":"IF($K$1=1,D258,G258)","v":"position"},null,{"$f":"IF($K$1=1,IF(E258=\"\",\"\",E258),IF(H258=\"\",\"\",H258))","v":"location"},{"$f":"IF($K$1=1,G258,D258)","v":"der Standort"}]
[null,"33-Adverbs 1",{"$f":"IF(AND(LEFT(D259,1)=\"d\",MID(D259,4,1)=\" \"),RIGHT(D259,LEN(D259)-4),D259)","v":"zuletzt"},"zuletzt",null,0,"last","(position)",0,{"$f":"RAND()","v":0.13706481468950693},{"$f":"IF(Table24[[#This Row],[Type Here]]=\"\",\"\",IF(Table24[[#This Row],[Type Here]]=Table24[[#This Row],[Answer]],1,-2))","v":""},{"$f":"IF($K$1=1,Table24[[#This Row],[Strength1]],Table24[[#This Row],[Strength2]])","v":0},{"$f":"IF($K$1=1,D259,G259)","v":"last"},null,{"$f":"IF($K$1=1,IF(E259=\"\",\"\",E259),IF(H259=\"\",\"\",H259))","v":"(position)"},{"$f":"IF($K$1=1,G259,D259)","v":"zuletzt"}]
[null,"14-Household",{"$f":"IF(AND(LEFT(D260,1)=\"d\",MID(D260,4,1)=\" \"),RIGHT(D260,LEN(D260)-4),D260)","v":"Bäder"},"die Bäder",null,0,"baths",null,-2,{"$f":"RAND()","v":0.28368421481906825},{"$f":"IF(Table24[[#This Row],[Type Here]]=\"\",\"\",IF(Table24[[#This Row],[Type Here]]=Table24[[#This Row],[Answer]],1,-2))","v":""},{"$f":"IF($K$1=1,Table24[[#This Row],[Strength1]],Table24[[#This Row],[Strength2]])","v":-2},{"$f":"IF($K$1=1,D260,G260)","v":"baths"},null,{"$f":"IF($K$1=1,IF(E260=\"\",\"\",E260),IF(H260=\"\",\"\",H260))","v":""},{"$f":"IF($K$1=1,G260,D260)","v":"die Bäder"}]
[null,"01-Basics 1",{"$f":"IF(AND(LEFT(D261,1)=\"d\",MID(D261,4,1)=\" \"),RIGHT(D261,LEN(D261)-4),D261)","v":"der"},"der","(article - Gen fem)",0,"the","Gen fem",0,{"$f":"RAND()","v":0.04808488394547761},{"$f":"IF(Table24[[#This Row],[Type Here]]=\"\",\"\",IF(Table24[[#This Row],[Type Here]]=Table24[[#This Row],[Answer]],1,-2))","v":""},{"$f":"IF($K$1=1,Table24[[#This Row],[Strength1]],Table24[[#This Row],[Strength2]])","v":0},{"$f":"IF($K$1=1,D261,G261)","v":"the"},null,{"$f":"IF($K$1=1,IF(E261=\"\",\"\",E261),IF(H261=\"\",\"\",H261))","v":"Gen fem"},{"$f":"IF($K$1=1,G261,D261)","v":"der"}]
[null,"40-Places",{"$f":"IF(AND(LEFT(D262,1)=\"d\",MID(D262,4,1)=\" \"),RIGHT(D262,LEN(D262)-4),D262)","v":"Bereich"},"der Bereich",null,0,"area","(region, sector)",0,{"$f":"RAND()","v":0.2802565197307285},{"$f":"IF(Table24[[#This Row],[Type Here]]=\"\",\"\",IF(Table24[[#This Row],[Type Here]]=Table24[[#This Row],[Answer]],1,-2))","v":""},{"$f":"IF($K$1=1,Table24[[#This Row],[Strength1]],Table24[[#This Row],[Strength2]])","v":0},{"$f":"IF($K$1=1,D262,G262)","v":"area"},null,{"$f":"IF($K$1=1,IF(E262=\"\",\"\",E262),IF(H262=\"\",\"\",H262))","v":"(region, sector)"},{"$f":"IF($K$1=1,G262,D262)","v":"der Bereich"}]
[null,"14-Household",{"$f":"IF(AND(LEFT(D263,1)=\"d\",MID(D263,4,1)=\" \"),RIGHT(D263,LEN(D263)-4),D263)","v":"Rasierer"},"der Rasierer",null,0,"razor",null,-3,{"$f":"RAND()","v":0.3754610758288922},{"$f":"IF(Table24[[#This Row],[Type Here]]=\"\",\"\",IF(Table24[[#This Row],[Type Here]]=Table24[[#This Row],[Answer]],1,-2))","v":""},{"$f":"IF($K$1=1,Table24[[#This Row],[Strength1]],Table24[[#This Row],[Strength2]])","v":-3},{"$f":"IF($K$1=1,D263,G263)","v":"razor"},null,{"$f":"IF($K$1=1,IF(E263=\"\",\"\",E263),IF(H263=\"\",\"\",H263))","v":""},{"$f":"IF($K$1=1,G263,D263)","v":"der Rasierer"}]
[null,"38-Ad: Nom. 1",{"$f":"IF(AND(LEFT(D264,1)=\"d\",MID(D264,4,1)=\" \"),RIGHT(D264,LEN(D264)-4),D264)","v":"notwendig"},"notwendig",null,0,"necessary",null,3,{"$f":"RAND()","v":0.059603365618261184},{"$f":"IF(Table24[[#This Row],[Type Here]]=\"\",\"\",IF(Table24[[#This Row],[Type Here]]=Table24[[#This Row],[Answer]],1,-2))","v":""},{"$f":"IF($K$1=1,Table24[[#This Row],[Strength1]],Table24[[#This Row],[Strength2]])","v":3},{"$f":"IF($K$1=1,D264,G264)","v":"necessary"},null,{"$f":"IF($K$1=1,IF(E264=\"\",\"\",E264),IF(H264=\"\",\"\",H264))","v":""},{"$f":"IF($K$1=1,G264,D264)","v":"notwendig"}]
[null,"39-Adj: Acc.",{"$f":"IF(AND(LEFT(D265,1)=\"d\",MID(D265,4,1)=\" \"),RIGHT(D265,LEN(D265)-4),D265)","v":"wesentlich"},"wesentlich",null,0,"essential",null,10,{"$f":"RAND()","v":0.6678660833526691},{"$f":"IF(Table24[[#This Row],[Type Here]]=\"\",\"\",IF(Table24[[#This Row],[Type Here]]=Table24[[#This Row],[Answer]],1,-2))","v":""},{"$f":"IF($K$1=1,Table24[[#This Row],[Strength1]],Table24[[#This Row],[Strength2]])","v":10},{"$f":"IF($K$1=1,D265,G265)","v":"essential"},null,{"$f":"IF($K$1=1,IF(E265=\"\",\"\",E265),IF(H265=\"\",\"\",H265))","v":""},{"$f":"IF($K$1=1,G265,D265)","v":"wesentlich"}]
[null,"14-Household",{"$f":"IF(AND(LEFT(D266,1)=\"d\",MID(D266,4,1)=\" \"),RIGHT(D266,LEN(D266)-4),D266)","v":"Räume"},"die Räume",null,0,"rooms","(spaces)",2,{"$f":"RAND()","v":0.395111741486885},{"$f":"IF(Table24[[#This Row],[Type Here]]=\"\",\"\",IF(Table24[[#This Row],[Type Here]]=Table24[[#This Row],[Answer]],1,-2))","v":""},{"$f":"IF($K$1=1,Table24[[#This Row],[Strength1]],Table24[[#This Row],[Strength2]])","v":2},{"$f":"IF($K$1=1,D266,G266)","v":"rooms"},null,{"$f":"IF($K$1=1,IF(E266=\"\",\"\",E266),IF(H266=\"\",\"\",H266))","v":"(spaces)"},{"$f":"IF($K$1=1,G266,D266)","v":"die Räume"}]
[null,"29-Medical",{"$f":"IF(AND(LEFT(D267,1)=\"d\",MID(D267,4,1)=\" \"),RIGHT(D267,LEN(D267)-4),D267)","v":"Hände"},"die Hände",null,0,"hands","anatomy",3,{"$f":"RAND()","v":0.1064056087741756},{"$f":"IF(Table24[[#This Row],[Type Here]]=\"\",\"\",IF(Table24[[#This Row],[Type Here]]=Table24[[#This Row],[Answer]],1,-2))","v":""},{"$f":"IF($K$1=1,Table24[[#This Row],[Strength1]],Table24[[#This Row],[Strength2]])","v":3},{"$f":"IF($K$1=1,D267,G267)","v":"hands"},null,{"$f":"IF($K$1=1,IF(E267=\"\",\"\",E267),IF(H267=\"\",\"\",H267))","v":"anatomy"},{"$f":"IF($K$1=1,G267,D267)","v":"die Hände"}]
[null,"33-Adverbs 1",{"$f":"IF(AND(LEFT(D268,1)=\"d\",MID(D268,4,1)=\" \"),RIGHT(D268,LEN(D268)-4),D268)","v":"weder...noch"},"weder...noch",null,0,"neither...nor",null,0,{"$f":"RAND()","v":0.24308870289004714},{"$f":"IF(Table24[[#This Row],[Type Here]]=\"\",\"\",IF(Table24[[#This Row],[Type Here]]=Table24[[#This Row],[Answer]],1,-2))","v":""},{"$f":"IF($K$1=1,Table24[[#This Row],[Strength1]],Table24[[#This Row],[Strength2]])","v":0},{"$f":"IF($K$1=1,D268,G268)","v":"neither...nor"},null,{"$f":"IF($K$1=1,IF(E268=\"\",\"\",E268),IF(H268=\"\",\"\",H268))","v":""},{"$f":"IF($K$1=1,G268,D268)","v":"weder...noch"}]
[null,"14-Household",{"$f":"IF(AND(LEFT(D269,1)=\"d\",MID(D269,4,1)=\" \"),RIGHT(D269,LEN(D269)-4),D269)","v":"Regenschirm"},"der Regenschirm",null,0,"umbrella",null,1,{"$f":"RAND()","v":0.4239216419923555},{"$f":"IF(Table24[[#This Row],[Type Here]]=\"\",\"\",IF(Table24[[#This Row],[Type Here]]=Table24[[#This Row],[Answer]],1,-2))","v":""},{"$f":"IF($K$1=1,Table24[[#This Row],[Strength1]],Table24[[#This Row],[Strength2]])","v":1},{"$f":"IF($K$1=1,D269,G269)","v":"umbrella"},null,{"$f":"IF($K$1=1,IF(E269=\"\",\"\",E269),IF(H269=\"\",\"\",H269))","v":""},{"$f":"IF($K$1=1,G269,D269)","v":"der Regenschirm"}]
[null,"29-Medical",{"$f":"IF(AND(LEFT(D270,1)=\"d\",MID(D270,4,1)=\" \"),RIGHT(D270,LEN(D270)-4),D270)","v":"Patient"},"der Patient",null,0,"patient","male (medical)",5,{"$f":"RAND()","v":0.7061730040085421},{"$f":"IF(Table24[[#This Row],[Type Here]]=\"\",\"\",IF(Table24[[#This Row],[Type Here]]=Table24[[#This Row],[Answer]],1,-2))","v":""},{"$f":"IF($K$1=1,Table24[[#This Row],[Strength1]],Table24[[#This Row],[Strength2]])","v":5},{"$f":"IF($K$1=1,D270,G270)","v":"patient"},null,{"$f":"IF($K$1=1,IF(E270=\"\",\"\",E270),IF(H270=\"\",\"\",H270))","v":"male (medical)"},{"$f":"IF($K$1=1,G270,D270)","v":"der Patient"}]
[null,"36-Nature",{"$f":"IF(AND(LEFT(D271,1)=\"d\",MID(D271,4,1)=\" \"),RIGHT(D271,LEN(D271)-4),D271)","v":"Stahl"},"der Stahl",null,0,"steel",null,6,{"$f":"RAND()","v":0.6503271250856623},{"$f":"IF(Table24[[#This Row],[Type Here]]=\"\",\"\",IF(Table24[[#This Row],[Type Here]]=Table24[[#This Row],[Answer]],1,-2))","v":""},{"$f":"IF($K$1=1,Table24[[#This Row],[Strength1]],Table24[[#This Row],[Strength2]])","v":6},{"$f":"IF($K$1=1,D271,G271)","v":"steel"},null,{"$f":"IF($K$1=1,IF(E271=\"\",\"\",E271),IF(H271=\"\",\"\",H271))","v":""},{"$f":"IF($K$1=1,G271,D271)","v":"der Stahl"}]
[null,"38-Ad: Nom. 1",{"$f":"IF(AND(LEFT(D272,1)=\"d\",MID(D272,4,1)=\" \"),RIGHT(D272,LEN(D272)-4),D272)","v":"individuell"},"individuell",null,0,"individual",null,3,{"$f":"RAND()","v":0.5110463503513183},{"$f":"IF(Table24[[#This Row],[Type Here]]=\"\",\"\",IF(Table24[[#This Row],[Type Here]]=Table24[[#This Row],[Answer]],1,-2))","v":""},{"$f":"IF($K$1=1,Table24[[#This Row],[Strength1]],Table24[[#This Row],[Strength2]])","v":3},{"$f":"IF($K$1=1,D272,G272)","v":"individual"},null,{"$f":"IF($K$1=1,IF(E272=\"\",\"\",E272),IF(H272=\"\",\"\",H272))","v":""},{"$f":"IF($K$1=1,G272,D272)","v":"individuell"}]
[null,"40-Places",{"$f":"IF(AND(LEFT(D273,1)=\"d\",MID(D273,4,1)=\" \"),RIGHT(D273,LEN(D273)-4),D273)","v":"Hallen"},"die Hallen",null,0,"halls",null,4,{"$f":"RAND()","v":0.686892954174763},{"$f":"IF(Table24[[#This Row],[Type Here]]=\"\",\"\",IF(Table24[[#This Row],[Type Here]]=Table24[[#This Row],[Answer]],1,-2))","v":""},{"$f":"IF($K$1=1,Table24[[#This Row],[Strength1]],Table24[[#This Row],[Strength2]])","v":4},{"$f":"IF($K$1=1,D273,G273)","v":"halls"},null,{"$f":"IF($K$1=1,IF(E273=\"\",\"\",E273),IF(H273=\"\",\"\",H273))","v":""},{"$f":"IF($K$1=1,G273,D273)","v":"die Hallen"}]
[null,"33-Adverbs 1",{"$f":"IF(AND(LEFT(D274,1)=\"d\",MID(D274,4,1)=\" \"),RIGHT(D274,LEN(D274)-4),D274)","v":"Ich bin nicht von gestern."},"Ich bin nicht von gestern.",null,0,"I was not born yesterday.",null,-2,{"$f":"RAND()","v":0.5678164896942215},{"$f":"IF(Table24[[#This Row],[Type Here]]=\"\",\"\",IF(Table24[[#This Row],[Type Here]]=Table24[[#This Row],[Answer]],1,-2))","v":""},{"$f":"IF($K$1=1,Table24[[#This Row],[Strength1]],Table24[[#This Row],[Strength2]])","v":-2},{"$f":"IF($K$1=1,D274,G274)","v":"I was not born yesterday."},null,{"$f":"IF($K$1=1,IF(E274=\"\",\"\",E274),IF(H274=\"\",\"\",H274))","v":""},{"$f":"IF($K$1=1,G274,D274)","v":"Ich bin nicht von gestern."}]
[null,"03-Phrases",{"$f":"IF(AND(LEFT(D275,1)=\"d\",MID(D275,4,1)=\" \"),RIGHT(D275,LEN(D275)-4),D275)","v":"Auf Wiedersehen."},"Auf Wiedersehen.",null,0,"Goodbye.","(until we meet again)",-3,{"$f":"RAND()","v":0.633916743659022},{"$f":"IF(Table24[[#This Row],[Type Here]]=\"\",\"\",IF(Table24[[#This Row],[Type Here]]=Table24[[#This Row],[Answer]],1,-2))","v":""},{"$f":"IF($K$1=1,Table24[[#This Row],[Strength1]],Table24[[#This Row],[Strength2]])","v":-3},{"$f":"IF($K$1=1,D275,G275)","v":"Goodbye."},null,{"$f":"IF($K$1=1,IF(E275=\"\",\"\",E275),IF(H275=\"\",\"\",H275))","v":"(until we meet again)"},{"$f":"IF($K$1=1,G275,D275)","v":"Auf Wiedersehen."}]
[null,"14-Household",{"$f":"IF(AND(LEFT(D276,1)=\"d\",MID(D276,4,1)=\" \"),RIGHT(D276,LEN(D276)-4),D276)","v":"Regenschirme"},"die Regenschirme",null,0,"umbrellas",null,1,{"$f":"RAND()","v":0.309035169889987},{"$f":"IF(Table24[[#This Row],[Type Here]]=\"\",\"\",IF(Table24[[#This Row],[Type Here]]=Table24[[#This Row],[Answer]],1,-2))","v":""},{"$f":"IF($K$1=1,Table24[[#This Row],[Strength1]],Table24[[#This Row],[Strength2]])","v":1},{"$f":"IF($K$1=1,D276,G276)","v":"umbrellas"},null,{"$f":"IF($K$1=1,IF(E276=\"\",\"\",E276),IF(H276=\"\",\"\",H276))","v":""},{"$f":"IF($K$1=1,G276,D276)","v":"die Regenschirme"}]
[null,"04-Food",{"$f":"IF(AND(LEFT(D277,1)=\"d\",MID(D277,4,1)=\" \"),RIGHT(D277,LEN(D277)-4),D277)","v":"Salz"},"das Salz",null,0,"salt","noun",-2,{"$f":"RAND()","v":0.5410280889863949},{"$f":"IF(Table24[[#This Row],[Type Here]]=\"\",\"\",IF(Table24[[#This Row],[Type Here]]=Table24[[#This Row],[Answer]],1,-2))","v":""},{"$f":"IF($K$1=1,Table24[[#This Row],[Strength1]],Table24[[#This Row],[Strength2]])","v":-2},{"$f":"IF($K$1=1,D277,G277)","v":"salt"},null,{"$f":"IF($K$1=1,IF(E277=\"\",\"\",E277),IF(H277=\"\",\"\",H277))","v":"noun"},{"$f":"IF($K$1=1,G277,D277)","v":"das Salz"}]
[null,"04-Food",{"$f":"IF(AND(LEFT(D278,1)=\"d\",MID(D278,4,1)=\" \"),RIGHT(D278,LEN(D278)-4),D278)","v":"Reis"},"das Reis",null,0,"rice",null,2,{"$f":"RAND()","v":0.4768629551769824},{"$f":"IF(Table24[[#This Row],[Type Here]]=\"\",\"\",IF(Table24[[#This Row],[Type Here]]=Table24[[#This Row],[Answer]],1,-2))","v":""},{"$f":"IF($K$1=1,Table24[[#This Row],[Strength1]],Table24[[#This Row],[Strength2]])","v":2},{"$f":"IF($K$1=1,D278,G278)","v":"rice"},null,{"$f":"IF($K$1=1,IF(E278=\"\",\"\",E278),IF(H278=\"\",\"\",H278))","v":""},{"$f":"IF($K$1=1,G278,D278)","v":"das Reis"}]
[null,"40-Places",{"$f":"IF(AND(LEFT(D279,1)=\"d\",MID(D279,4,1)=\" \"),RIGHT(D279,LEN(D279)-4),D279)","v":"Bezirke"},"die Bezirke",null,0,"districts","(precincts, boroughs)",2,{"$f":"RAND()","v":0.7138335531988517},{"$f":"IF(Table24[[#This Row],[Type Here]]=\"\",\"\",IF(Table24[[#This Row],[Type Here]]=Table24[[#This Row],[Answer]],1,-2))","v":""},{"$f":"IF($K$1=1,Table24[[#This Row],[Strength1]],Table24[[#This Row],[Strength2]])","v":2},{"$f":"IF($K$1=1,D279,G279)","v":"districts"},null,{"$f":"IF($K$1=1,IF(E279=\"\",\"\",E279),IF(H279=\"\",\"\",H279))","v":"(precincts, boroughs)"},{"$f":"IF($K$1=1,G279,D279)","v":"die Bezirke"}]
[null,"40-Places",{"$f":"IF(AND(LEFT(D280,1)=\"d\",MID(D280,4,1)=\" \"),RIGHT(D280,LEN(D280)-4),D280)","v":"Städte"},"die Städte",null,0,"cities",null,2,{"$f":"RAND()","v":0.7499298773595853},{"$f":"IF(Table24[[#This Row],[Type Here]]=\"\",\"\",IF(Table24[[#This Row],[Type Here]]=Table24[[#This Row],[Answer]],1,-2))","v":""},{"$f":"IF($K$1=1,Table24[[#This Row],[Strength1]],Table24[[#This Row],[Strength2]])","v":2},{"$f":"IF($K$1=1,D280,G280)","v":"cities"},null,{"$f":"IF($K$1=1,IF(E280=\"\",\"\",E280),IF(H280=\"\",\"\",H280))","v":""},{"$f":"IF($K$1=1,G280,D280)","v":"die Städte"}]
[null,"02-Basics 2",{"$f":"IF(AND(LEFT(D281,1)=\"d\",MID(D281,4,1)=\" \"),RIGHT(D281,LEN(D281)-4),D281)","v":"wir haben"},"wir haben",null,0,"we have",null,0,{"$f":"RAND()","v":0.2889999572844798},{"$f":"IF(Table24[[#This Row],[Type Here]]=\"\",\"\",IF(Table24[[#This Row],[Type Here]]=Table24[[#This Row],[Answer]],1,-2))","v":""},{"$f":"IF($K$1=1,Table24[[#This Row],[Strength1]],Table24[[#This Row],[Strength2]])","v":0},{"$f":"IF($K$1=1,D281,G281)","v":"we have"},null,{"$f":"IF($K$1=1,IF(E281=\"\",\"\",E281),IF(H281=\"\",\"\",H281))","v":""},{"$f":"IF($K$1=1,G281,D281)","v":"wir haben"}]
[null,"29-Medical",{"$f":"IF(AND(LEFT(D282,1)=\"d\",MID(D282,4,1)=\" \"),RIGHT(D282,LEN(D282)-4),D282)","v":"Krankheiten"},"die Krankheiten",null,0,"diseases",null,3,{"$f":"RAND()","v":0.10418725491074343},{"$f":"IF(Table24[[#This Row],[Type Here]]=\"\",\"\",IF(Table24[[#This Row],[Type Here]]=Table24[[#This Row],[Answer]],1,-2))","v":""},{"$f":"IF($K$1=1,Table24[[#This Row],[Strength1]],Table24[[#This Row],[Strength2]])","v":3},{"$f":"IF($K$1=1,D282,G282)","v":"diseases"},null,{"$f":"IF($K$1=1,IF(E282=\"\",\"\",E282),IF(H282=\"\",\"\",H282))","v":""},{"$f":"IF($K$1=1,G282,D282)","v":"die Krankheiten"}]
[null,"33-Adverbs 1",{"$f":"IF(AND(LEFT(D283,1)=\"d\",MID(D283,4,1)=\" \"),RIGHT(D283,LEN(D283)-4),D283)","v":"gerne"},"gerne",null,0,"gladly",null,-1,{"$f":"RAND()","v":0.6705057951888033},{"$f":"IF(Table24[[#This Row],[Type Here]]=\"\",\"\",IF(Table24[[#This Row],[Type Here]]=Table24[[#This Row],[Answer]],1,-2))","v":""},{"$f":"IF($K$1=1,Table24[[#This Row],[Strength1]],Table24[[#This Row],[Strength2]])","v":-1},{"$f":"IF($K$1=1,D283,G283)","v":"gladly"},null,{"$f":"IF($K$1=1,IF(E283=\"\",\"\",E283),IF(H283=\"\",\"\",H283))","v":""},{"$f":"IF($K$1=1,G283,D283)","v":"gerne"}]
[null,"01-Basics 1",{"$f":"IF(AND(LEFT(D284,1)=\"d\",MID(D284,4,1)=\" \"),RIGHT(D284,LEN(D284)-4),D284)","v":"ich bin"},"ich bin",null,0,"I am",null,2,{"$f":"RAND()","v":0.7150315603369547},{"$f":"IF(Table24[[#This Row],[Type Here]]=\"\",\"\",IF(Table24[[#This Row],[Type Here]]=Table24[[#This Row],[Answer]],1,-2))","v":""},{"$f":"IF($K$1=1,Table24[[#This Row],[Strength1]],Table24[[#This Row],[Strength2]])","v":2},{"$f":"IF($K$1=1,D284,G284)","v":"I am"},null,{"$f":"IF($K$1=1,IF(E284=\"\",\"\",E284),IF(H284=\"\",\"\",H284))","v":""},{"$f":"IF($K$1=1,G284,D284)","v":"ich bin"}]
[null,"14-Household",{"$f":"IF(AND(LEFT(D285,1)=\"d\",MID(D285,4,1)=\" \"),RIGHT(D285,LEN(D285)-4),D285)","v":"Leiterin"},"die Leiterin",null,0,"leader","female",1,{"$f":"RAND()","v":0.27395488547933855},{"$f":"IF(Table24[[#This Row],[Type Here]]=\"\",\"\",IF(Table24[[#This Row],[Type Here]]=Table24[[#This Row],[Answer]],1,-2))","v":""},{"$f":"IF($K$1=1,Table24[[#This Row],[Strength1]],Table24[[#This Row],[Strength2]])","v":1},{"$f":"IF($K$1=1,D285,G285)","v":"leader"},null,{"$f":"IF($K$1=1,IF(E285=\"\",\"\",E285),IF(H285=\"\",\"\",H285))","v":"female"},{"$f":"IF($K$1=1,G285,D285)","v":"die Leiterin"}]
[null,"29-Medical",{"$f":"IF(AND(LEFT(D286,1)=\"d\",MID(D286,4,1)=\" \"),RIGHT(D286,LEN(D286)-4),D286)","v":"Haare"},"die Haare",null,0,"hair","plural (ie \"head of hair\")",4,{"$f":"RAND()","v":0.2087214285671155},{"$f":"IF(Table24[[#This Row],[Type Here]]=\"\",\"\",IF(Table24[[#This Row],[Type Here]]=Table24[[#This Row],[Answer]],1,-2))","v":""},{"$f":"IF($K$1=1,Table24[[#This Row],[Strength1]],Table24[[#This Row],[Strength2]])","v":4},{"$f":"IF($K$1=1,D286,G286)","v":"hair"},null,{"$f":"IF($K$1=1,IF(E286=\"\",\"\",E286),IF(H286=\"\",\"\",H286))","v":"plural (ie \"head of hair\")"},{"$f":"IF($K$1=1,G286,D286)","v":"die Haare"}]
[null,"05-Animals",{"$f":"IF(AND(LEFT(D287,1)=\"d\",MID(D287,4,1)=\" \"),RIGHT(D287,LEN(D287)-4),D287)","v":"Haustiere"},"die Haustiere",null,0,"pets","noun",0,{"$f":"RAND()","v":0.32679616381275123},{"$f":"IF(Table24[[#This Row],[Type Here]]=\"\",\"\",IF(Table24[[#This Row],[Type Here]]=Table24[[#This Row],[Answer]],1,-2))","v":""},{"$f":"IF($K$1=1,Table24[[#This Row],[Strength1]],Table24[[#This Row],[Strength2]])","v":0},{"$f":"IF($K$1=1,D287,G287)","v":"pets"},null,{"$f":"IF($K$1=1,IF(E287=\"\",\"\",E287),IF(H287=\"\",\"\",H287))","v":"noun"},{"$f":"IF($K$1=1,G287,D287)","v":"die Haustiere"}]
[null,"14-Household",{"$f":"IF(AND(LEFT(D288,1)=\"d\",MID(D288,4,1)=\" \"),RIGHT(D288,LEN(D288)-4),D288)","v":"Licht"},"das Licht",null,0,"light","noun",0,{"$f":"RAND()","v":0.7061026631651236},{"$f":"IF(Table24[[#This Row],[Type Here]]=\"\",\"\",IF(Table24[[#This Row],[Type Here]]=Table24[[#This Row],[Answer]],1,-2))","v":""},{"$f":"IF($K$1=1,Table24[[#This Row],[Strength1]],Table24[[#This Row],[Strength2]])","v":0},{"$f":"IF($K$1=1,D288,G288)","v":"light"},null,{"$f":"IF($K$1=1,IF(E288=\"\",\"\",E288),IF(H288=\"\",\"\",H288))","v":"noun"},{"$f":"IF($K$1=1,G288,D288)","v":"das Licht"}]
[null,"04-Food",{"$f":"IF(AND(LEFT(D289,1)=\"d\",MID(D289,4,1)=\" \"),RIGHT(D289,LEN(D289)-4),D289)","v":"Menü"},"das Menü",null,0,"menu",null,-2,{"$f":"RAND()","v":0.5927759044009263},{"$f":"IF(Table24[[#This Row],[Type Here]]=\"\",\"\",IF(Table24[[#This Row],[Type Here]]=Table24[[#This Row],[Answer]],1,-2))","v":""},{"$f":"IF($K$1=1,Table24[[#This Row],[Strength1]],Table24[[#This Row],[Strength2]])","v":-2},{"$f":"IF($K$1=1,D289,G289)","v":"menu"},null,{"$f":"IF($K$1=1,IF(E289=\"\",\"\",E289),IF(H289=\"\",\"\",H289))","v":""},{"$f":"IF($K$1=1,G289,D289)","v":"das Menü"}]
[null,"33-Adverbs 1",{"$f":"IF(AND(LEFT(D290,1)=\"d\",MID(D290,4,1)=\" \"),RIGHT(D290,LEN(D290)-4),D290)","v":"immer"},"immer",null,0,"always",null,0,{"$f":"RAND()","v":0.041092541566659646},{"$f":"IF(Table24[[#This Row],[Type Here]]=\"\",\"\",IF(Table24[[#This Row],[Type Here]]=Table24[[#This Row],[Answer]],1,-2))","v":""},{"$f":"IF($K$1=1,Table24[[#This Row],[Strength1]],Table24[[#This Row],[Strength2]])","v":0},{"$f":"IF($K$1=1,D290,G290)","v":"always"},null,{"$f":"IF($K$1=1,IF(E290=\"\",\"\",E290),IF(H290=\"\",\"\",H290))","v":""},{"$f":"IF($K$1=1,G290,D290)","v":"immer"}]
[null,"01-Basics 1",{"$f":"IF(AND(LEFT(D291,1)=\"d\",MID(D291,4,1)=\" \"),RIGHT(D291,LEN(D291)-4),D291)","v":"der"},"der","(article - Nom masc)",0,"the","Nom masc",1,{"$f":"RAND()","v":0.2739741982485989},{"$f":"IF(Table24[[#This Row],[Type Here]]=\"\",\"\",IF(Table24[[#This Row],[Type Here]]=Table24[[#This Row],[Answer]],1,-2))","v":""},{"$f":"IF($K$1=1,Table24[[#This Row],[Strength1]],Table24[[#This Row],[Strength2]])","v":1},{"$f":"IF($K$1=1,D291,G291)","v":"the"},null,{"$f":"IF($K$1=1,IF(E291=\"\",\"\",E291),IF(H291=\"\",\"\",H291))","v":"Nom masc"},{"$f":"IF($K$1=1,G291,D291)","v":"der"}]
[null,"02-Basics 2",{"$f":"IF(AND(LEFT(D292,1)=\"d\",MID(D292,4,1)=\" \"),RIGHT(D292,LEN(D292)-4),D292)","v":"Männer"},"die Männer","(spouses)",0,"husbands",null,1,{"$f":"RAND()","v":0.3673935721329882},{"$f":"IF(Table24[[#This Row],[Type Here]]=\"\",\"\",IF(Table24[[#This Row],[Type Here]]=Table24[[#This Row],[Answer]],1,-2))","v":""},{"$f":"IF($K$1=1,Table24[[#This Row],[Strength1]],Table24[[#This Row],[Strength2]])","v":1},{"$f":"IF($K$1=1,D292,G292)","v":"husbands"},null,{"$f":"IF($K$1=1,IF(E292=\"\",\"\",E292),IF(H292=\"\",\"\",H292))","v":""},{"$f":"IF($K$1=1,G292,D292)","v":"die Männer"}]
[null,"02-Basics 2",{"$f":"IF(AND(LEFT(D293,1)=\"d\",MID(D293,4,1)=\" \"),RIGHT(D293,LEN(D293)-4),D293)","v":"er trinkt"},"er trinkt",null,0,"he drinks",null,1,{"$f":"RAND()","v":0.47776444370744375},{"$f":"IF(Table24[[#This Row],[Type Here]]=\"\",\"\",IF(Table24[[#This Row],[Type Here]]=Table24[[#This Row],[Answer]],1,-2))","v":""},{"$f":"IF($K$1=1,Table24[[#This Row],[Strength1]],Table24[[#This Row],[Strength2]])","v":1},{"$f":"IF($K$1=1,D293,G293)","v":"he drinks"},null,{"$f":"IF($K$1=1,IF(E293=\"\",\"\",E293),IF(H293=\"\",\"\",H293))","v":""},{"$f":"IF($K$1=1,G293,D293)","v":"er trinkt"}]
[null,"29-Medical",{"$f":"IF(AND(LEFT(D294,1)=\"d\",MID(D294,4,1)=\" \"),RIGHT(D294,LEN(D294)-4),D294)","v":"Apotheke"},"die Apotheke",null,0,"pharmacy","(chemist's shop)",1,{"$f":"RAND()","v":0.7459533974200171},{"$f":"IF(Table24[[#This Row],[Type Here]]=\"\",\"\",IF(Table24[[#This Row],[Type Here]]=Table24[[#This Row],[Answer]],1,-2))","v":""},{"$f":"IF($K$1=1,Table24[[#This Row],[Strength1]],Table24[[#This Row],[Strength2]])","v":1},{"$f":"IF($K$1=1,D294,G294)","v":"pharmacy"},null,{"$f":"IF($K$1=1,IF(E294=\"\",\"\",E294),IF(H294=\"\",\"\",H294))","v":"(chemist's shop)"},{"$f":"IF($K$1=1,G294,D294)","v":"die Apotheke"}]
[null,"33-Adverbs 1",{"$f":"IF(AND(LEFT(D295,1)=\"d\",MID(D295,4,1)=\" \"),RIGHT(D295,LEN(D295)-4),D295)","v":"hingegen"},"hingegen",null,0,"on the other hand",null,-2,{"$f":"RAND()","v":0.2906947005250431},{"$f":"IF(Table24[[#This Row],[Type Here]]=\"\",\"\",IF(Table24[[#This Row],[Type Here]]=Table24[[#This Row],[Answer]],1,-2))","v":""},{"$f":"IF($K$1=1,Table24[[#This Row],[Strength1]],Table24[[#This Row],[Strength2]])","v":-2},{"$f":"IF($K$1=1,D295,G295)","v":"on the other hand"},null,{"$f":"IF($K$1=1,IF(E295=\"\",\"\",E295),IF(H295=\"\",\"\",H295))","v":""},{"$f":"IF($K$1=1,G295,D295)","v":"hingegen"}]
[null,"33-Adverbs 1",{"$f":"IF(AND(LEFT(D296,1)=\"d\",MID(D296,4,1)=\" \"),RIGHT(D296,LEN(D296)-4),D296)","v":"kaum"},"kaum",null,0,"hardly",null,0,{"$f":"RAND()","v":0.28040764121755035},{"$f":"IF(Table24[[#This Row],[Type Here]]=\"\",\"\",IF(Table24[[#This Row],[Type Here]]=Table24[[#This Row],[Answer]],1,-2))","v":""},{"$f":"IF($K$1=1,Table24[[#This Row],[Strength1]],Table24[[#This Row],[Strength2]])","v":0},{"$f":"IF($K$1=1,D296,G296)","v":"hardly"},null,{"$f":"IF($K$1=1,IF(E296=\"\",\"\",E296),IF(H296=\"\",\"\",H296))","v":""},{"$f":"IF($K$1=1,G296,D296)","v":"kaum"}]
[null,"02-Basics 2",{"$f":"IF(AND(LEFT(D297,1)=\"d\",MID(D297,4,1)=\" \"),RIGHT(D297,LEN(D297)-4),D297)","v":"Kinder"},"die Kinder",null,0,"children",null,1,{"$f":"RAND()","v":0.12994977966794685},{"$f":"IF(Table24[[#This Row],[Type Here]]=\"\",\"\",IF(Table24[[#This Row],[Type Here]]=Table24[[#This Row],[Answer]],1,-2))","v":""},{"$f":"IF($K$1=1,Table24[[#This Row],[Strength1]],Table24[[#This Row],[Strength2]])","v":1},{"$f":"IF($K$1=1,D297,G297)","v":"children"},null,{"$f":"IF($K$1=1,IF(E297=\"\",\"\",E297),IF(H297=\"\",\"\",H297))","v":""},{"$f":"IF($K$1=1,G297,D297)","v":"die Kinder"}]
[null,"29-Medical",{"$f":"IF(AND(LEFT(D298,1)=\"d\",MID(D298,4,1)=\" \"),RIGHT(D298,LEN(D298)-4),D298)","v":"Krankheit"},"die Krankheit",null,0,"disease",null,3,{"$f":"RAND()","v":0.25694199490143876},{"$f":"IF(Table24[[#This Row],[Type Here]]=\"\",\"\",IF(Table24[[#This Row],[Type Here]]=Table24[[#This Row],[Answer]],1,-2))","v":""},{"$f":"IF($K$1=1,Table24[[#This Row],[Strength1]],Table24[[#This Row],[Strength2]])","v":3},{"$f":"IF($K$1=1,D298,G298)","v":"disease"},null,{"$f":"IF($K$1=1,IF(E298=\"\",\"\",E298),IF(H298=\"\",\"\",H298))","v":""},{"$f":"IF($K$1=1,G298,D298)","v":"die Krankheit"}]
[null,"29-Medical",{"$f":"IF(AND(LEFT(D299,1)=\"d\",MID(D299,4,1)=\" \"),RIGHT(D299,LEN(D299)-4),D299)","v":"Patientin"},"die Patientin",null,0,"patient","female (medical)",5,{"$f":"RAND()","v":0.6696429598560538},{"$f":"IF(Table24[[#This Row],[Type Here]]=\"\",\"\",IF(Table24[[#This Row],[Type Here]]=Table24[[#This Row],[Answer]],1,-2))","v":""},{"$f":"IF($K$1=1,Table24[[#This Row],[Strength1]],Table24[[#This Row],[Strength2]])","v":5},{"$f":"IF($K$1=1,D299,G299)","v":"patient"},null,{"$f":"IF($K$1=1,IF(E299=\"\",\"\",E299),IF(H299=\"\",\"\",H299))","v":"female (medical)"},{"$f":"IF($K$1=1,G299,D299)","v":"die Patientin"}]
[null,"07-Adjectives",{"$f":"IF(AND(LEFT(D300,1)=\"d\",MID(D300,4,1)=\" \"),RIGHT(D300,LEN(D300)-4),D300)","v":"nützlich"},"nützlich",null,0,"useful",null,0,{"$f":"RAND()","v":0.9829585245216691},{"$f":"IF(Table24[[#This Row],[Type Here]]=\"\",\"\",IF(Table24[[#This Row],[Type Here]]=Table24[[#This Row],[Answer]],1,-2))","v":""},{"$f":"IF($K$1=1,Table24[[#This Row],[Strength1]],Table24[[#This Row],[Strength2]])","v":0},{"$f":"IF($K$1=1,D300,G300)","v":"useful"},null,{"$f":"IF($K$1=1,IF(E300=\"\",\"\",E300),IF(H300=\"\",\"\",H300))","v":""},{"$f":"IF($K$1=1,G300,D300)","v":"nützlich"}]
[null,"39-Adj: Acc.",{"$f":"IF(AND(LEFT(D301,1)=\"d\",MID(D301,4,1)=\" \"),RIGHT(D301,LEN(D301)-4),D301)","v":"modern"},"modern",null,0,"modern",null,10,{"$f":"RAND()","v":0.4457046700495221},{"$f":"IF(Table24[[#This Row],[Type Here]]=\"\",\"\",IF(Table24[[#This Row],[Type Here]]=Table24[[#This Row],[Answer]],1,-2))","v":""},{"$f":"IF($K$1=1,Table24[[#This Row],[Strength1]],Table24[[#This Row],[Strength2]])","v":10},{"$f":"IF($K$1=1,D301,G301)","v":"modern"},null,{"$f":"IF($K$1=1,IF(E301=\"\",\"\",E301),IF(H301=\"\",\"\",H301))","v":""},{"$f":"IF($K$1=1,G301,D301)","v":"modern"}]
[null,"40-Places",{"$f":"IF(AND(LEFT(D302,1)=\"d\",MID(D302,4,1)=\" \"),RIGHT(D302,LEN(D302)-4),D302)","v":"Inseln"},"die Inseln",null,0,"islands",null,2,{"$f":"RAND()","v":0.6314687455809166},{"$f":"IF(Table24[[#This Row],[Type Here]]=\"\",\"\",IF(Table24[[#This Row],[Type Here]]=Table24[[#This Row],[Answer]],1,-2))","v":""},{"$f":"IF($K$1=1,Table24[[#This Row],[Strength1]],Table24[[#This Row],[Strength2]])","v":2},{"$f":"IF($K$1=1,D302,G302)","v":"islands"},null,{"$f":"IF($K$1=1,IF(E302=\"\",\"\",E302),IF(H302=\"\",\"\",H302))","v":""},{"$f":"IF($K$1=1,G302,D302)","v":"die Inseln"}]
[null,"05-Animals",{"$f":"IF(AND(LEFT(D303,1)=\"d\",MID(D303,4,1)=\" \"),RIGHT(D303,LEN(D303)-4),D303)","v":"Mäuse"},"die Mäuse",null,0,"mice",null,0,{"$f":"RAND()","v":0.4915238119009594},{"$f":"IF(Table24[[#This Row],[Type Here]]=\"\",\"\",IF(Table24[[#This Row],[Type Here]]=Table24[[#This Row],[Answer]],1,-2))","v":""},{"$f":"IF($K$1=1,Table24[[#This Row],[Strength1]],Table24[[#This Row],[Strength2]])","v":0},{"$f":"IF($K$1=1,D303,G303)","v":"mice"},null,{"$f":"IF($K$1=1,IF(E303=\"\",\"\",E303),IF(H303=\"\",\"\",H303))","v":""},{"$f":"IF($K$1=1,G303,D303)","v":"die Mäuse"}]
[null,"29-Medical",{"$f":"IF(AND(LEFT(D304,1)=\"d\",MID(D304,4,1)=\" \"),RIGHT(D304,LEN(D304)-4),D304)","v":"Diäten"},"die Diäten",null,0,"diets",null,4,{"$f":"RAND()","v":0.562256213151878},{"$f":"IF(Table24[[#This Row],[Type Here]]=\"\",\"\",IF(Table24[[#This Row],[Type Here]]=Table24[[#This Row],[Answer]],1,-2))","v":""},{"$f":"IF($K$1=1,Table24[[#This Row],[Strength1]],Table24[[#This Row],[Strength2]])","v":4},{"$f":"IF($K$1=1,D304,G304)","v":"diets"},null,{"$f":"IF($K$1=1,IF(E304=\"\",\"\",E304),IF(H304=\"\",\"\",H304))","v":""},{"$f":"IF($K$1=1,G304,D304)","v":"die Diäten"}]
[null,"29-Medical",{"$f":"IF(AND(LEFT(D305,1)=\"d\",MID(D305,4,1)=\" \"),RIGHT(D305,LEN(D305)-4),D305)","v":"Praxis"},"die Praxis",null,0,"practice","(eg medical practice)",6,{"$f":"RAND()","v":0.05321980065160936},{"$f":"IF(Table24[[#This Row],[Type Here]]=\"\",\"\",IF(Table24[[#This Row],[Type Here]]=Table24[[#This Row],[Answer]],1,-2))","v":""},{"$f":"IF($K$1=1,Table24[[#This Row],[Strength1]],Table24[[#This Row],[Strength2]])","v":6},{"$f":"IF($K$1=1,D305,G305)","v":"practice"},null,{"$f":"IF($K$1=1,IF(E305=\"\",\"\",E305),IF(H305=\"\",\"\",H305))","v":"(eg medical practice)"},{"$f":"IF($K$1=1,G305,D305)","v":"die Praxis"}]
[null,"02-Basics 2",{"$f":"IF(AND(LEFT(D306,1)=\"d\",MID(D306,4,1)=\" \"),RIGHT(D306,LEN(D306)-4),D306)","v":"wir essen"},"wir essen",null,0,"we eat",null,0,{"$f":"RAND()","v":0.010753399010389963},{"$f":"IF(Table24[[#This Row],[Type Here]]=\"\",\"\",IF(Table24[[#This Row],[Type Here]]=Table24[[#This Row],[Answer]],1,-2))","v":""},{"$f":"IF($K$1=1,Table24[[#This Row],[Strength1]],Table24[[#This Row],[Strength2]])","v":0},{"$f":"IF($K$1=1,D306,G306)","v":"we eat"},null,{"$f":"IF($K$1=1,IF(E306=\"\",\"\",E306),IF(H306=\"\",\"\",H306))","v":""},{"$f":"IF($K$1=1,G306,D306)","v":"wir essen"}]
[null,"14-Household",{"$f":"IF(AND(LEFT(D307,1)=\"d\",MID(D307,4,1)=\" \"),RIGHT(D307,LEN(D307)-4),D307)","v":"Tisch"},"der Tisch",null,0,"table",null,1,{"$f":"RAND()","v":0.6537849184695836},{"$f":"IF(Table24[[#This Row],[Type Here]]=\"\",\"\",IF(Table24[[#This Row],[Type Here]]=Table24[[#This Row],[Answer]],1,-2))","v":""},{"$f":"IF($K$1=1,Table24[[#This Row],[Strength1]],Table24[[#This Row],[Strength2]])","v":1},{"$f":"IF($K$1=1,D307,G307)","v":"table"},null,{"$f":"IF($K$1=1,IF(E307=\"\",\"\",E307),IF(H307=\"\",\"\",H307))","v":""},{"$f":"IF($K$1=1,G307,D307)","v":"der Tisch"}]
[null,"36-Nature",{"$f":"IF(AND(LEFT(D308,1)=\"d\",MID(D308,4,1)=\" \"),RIGHT(D308,LEN(D308)-4),D308)","v":"Stein"},"der Stein",null,0,"stone","noun",7,{"$f":"RAND()","v":0.10285610096381792},{"$f":"IF(Table24[[#This Row],[Type Here]]=\"\",\"\",IF(Table24[[#This Row],[Type Here]]=Table24[[#This Row],[Answer]],1,-2))","v":""},{"$f":"IF($K$1=1,Table24[[#This Row],[Strength1]],Table24[[#This Row],[Strength2]])","v":7},{"$f":"IF($K$1=1,D308,G308)","v":"stone"},null,{"$f":"IF($K$1=1,IF(E308=\"\",\"\",E308),IF(H308=\"\",\"\",H308))","v":"noun"},{"$f":"IF($K$1=1,G308,D308)","v":"der Stein"}]
[null,"36-Nature",{"$f":"IF(AND(LEFT(D309,1)=\"d\",MID(D309,4,1)=\" \"),RIGHT(D309,LEN(D309)-4),D309)","v":"Regen"},"der Regen",null,0,"rain",null,6,{"$f":"RAND()","v":0.6983247334536035},{"$f":"IF(Table24[[#This Row],[Type Here]]=\"\",\"\",IF(Table24[[#This Row],[Type Here]]=Table24[[#This Row],[Answer]],1,-2))","v":""},{"$f":"IF($K$1=1,Table24[[#This Row],[Strength1]],Table24[[#This Row],[Strength2]])","v":6},{"$f":"IF($K$1=1,D309,G309)","v":"rain"},null,{"$f":"IF($K$1=1,IF(E309=\"\",\"\",E309),IF(H309=\"\",\"\",H309))","v":""},{"$f":"IF($K$1=1,G309,D309)","v":"der Regen"}]
[null,"38-Ad: Nom. 1",{"$f":"IF(AND(LEFT(D310,1)=\"d\",MID(D310,4,1)=\" \"),RIGHT(D310,LEN(D310)-4),D310)","v":"europäisch"},"europäisch",null,0,"European",null,3,{"$f":"RAND()","v":0.7930588598867625},{"$f":"IF(Table24[[#This Row],[Type Here]]=\"\",\"\",IF(Table24[[#This Row],[Type Here]]=Table24[[#This Row],[Answer]],1,-2))","v":""},{"$f":"IF($K$1=1,Table24[[#This Row],[Strength1]],Table24[[#This Row],[Strength2]])","v":3},{"$f":"IF($K$1=1,D310,G310)","v":"European"},null,{"$f":"IF($K$1=1,IF(E310=\"\",\"\",E310),IF(H310=\"\",\"\",H310))","v":""},{"$f":"IF($K$1=1,G310,D310)","v":"europäisch"}]
[null,"08-V. Pres. 1",{"$f":"IF(AND(LEFT(D311,1)=\"d\",MID(D311,4,1)=\" \"),RIGHT(D311,LEN(D311)-4),D311)","v":"mögen"},"mögen",null,0,"to like",null,0,{"$f":"RAND()","v":0.510057024847245},{"$f":"IF(Table24[[#This Row],[Type Here]]=\"\",\"\",IF(Table24[[#This Row],[Type Here]]=Table24[[#This Row],[Answer]],1,-2))","v":""},{"$f":"IF($K$1=1,Table24[[#This Row],[Strength1]],Table24[[#This Row],[Strength2]])","v":0},{"$f":"IF($K$1=1,D311,G311)","v":"to like"},null,{"$f":"IF($K$1=1,IF(E311=\"\",\"\",E311),IF(H311=\"\",\"\",H311))","v":""},{"$f":"IF($K$1=1,G311,D311)","v":"mögen"}]
[null,"36-Nature",{"$f":"IF(AND(LEFT(D312,1)=\"d\",MID(D312,4,1)=\" \"),RIGHT(D312,LEN(D312)-4),D312)","v":"Tierwelt"},"die Tierwelt",null,0,"animal world",null,6,{"$f":"RAND()","v":0.5520162592759532},{"$f":"IF(Table24[[#This Row],[Type Here]]=\"\",\"\",IF(Table24[[#This Row],[Type Here]]=Table24[[#This Row],[Answer]],1,-2))","v":""},{"$f":"IF($K$1=1,Table24[[#This Row],[Strength1]],Table24[[#This Row],[Strength2]])","v":6},{"$f":"IF($K$1=1,D312,G312)","v":"animal world"},null,{"$f":"IF($K$1=1,IF(E312=\"\",\"\",E312),IF(H312=\"\",\"\",H312))","v":""},{"$f":"IF($K$1=1,G312,D312)","v":"die Tierwelt"}]
[null,"40-Places",{"$f":"IF(AND(LEFT(D313,1)=\"d\",MID(D313,4,1)=\" \"),RIGHT(D313,LEN(D313)-4),D313)","v":"Fläche"},"die Fläche",null,0,"area","(surface area, like sq feet)",0,{"$f":"RAND()","v":0.23191988025967847},{"$f":"IF(Table24[[#This Row],[Type Here]]=\"\",\"\",IF(Table24[[#This Row],[Type Here]]=Table24[[#This Row],[Answer]],1,-2))","v":""},{"$f":"IF($K$1=1,Table24[[#This Row],[Strength1]],Table24[[#This Row],[Strength2]])","v":0},{"$f":"IF($K$1=1,D313,G313)","v":"area"},null,{"$f":"IF($K$1=1,IF(E313=\"\",\"\",E313),IF(H313=\"\",\"\",H313))","v":"(surface area, like sq feet)"},{"$f":"IF($K$1=1,G313,D313)","v":"die Fläche"}]
[null,"04-Food",{"$f":"IF(AND(LEFT(D314,1)=\"d\",MID(D314,4,1)=\" \"),RIGHT(D314,LEN(D314)-4),D314)","v":"Suppen"},"die Suppen",null,0,"soups",null,0,{"$f":"RAND()","v":0.7628159076265505},{"$f":"IF(Table24[[#This Row],[Type Here]]=\"\",\"\",IF(Table24[[#This Row],[Type Here]]=Table24[[#This Row],[Answer]],1,-2))","v":""},{"$f":"IF($K$1=1,Table24[[#This Row],[Strength1]],Table24[[#This Row],[Strength2]])","v":0},{"$f":"IF($K$1=1,D314,G314)","v":"soups"},null,{"$f":"IF($K$1=1,IF(E314=\"\",\"\",E314),IF(H314=\"\",\"\",H314))","v":""},{"$f":"IF($K$1=1,G314,D314)","v":"die Suppen"}]
[null,"04-Food",{"$f":"IF(AND(LEFT(D315,1)=\"d\",MID(D315,4,1)=\" \"),RIGHT(D315,LEN(D315)-4),D315)","v":"Suppe"},"die Suppe",null,0,"soup",null,3,{"$f":"RAND()","v":0.3999180777759419},{"$f":"IF(Table24[[#This Row],[Type Here]]=\"\",\"\",IF(Table24[[#This Row],[Type Here]]=Table24[[#This Row],[Answer]],1,-2))","v":""},{"$f":"IF($K$1=1,Table24[[#This Row],[Strength1]],Table24[[#This Row],[Strength2]])","v":3},{"$f":"IF($K$1=1,D315,G315)","v":"soup"},null,{"$f":"IF($K$1=1,IF(E315=\"\",\"\",E315),IF(H315=\"\",\"\",H315))","v":""},{"$f":"IF($K$1=1,G315,D315)","v":"die Suppe"}]
[null,"36-Nature",{"$f":"IF(AND(LEFT(D316,1)=\"d\",MID(D316,4,1)=\" \"),RIGHT(D316,LEN(D316)-4),D316)","v":"Natur"},"die Natur","(character, temprement)",0,"nature",null,7,{"$f":"RAND()","v":0.8522028316941866},{"$f":"IF(Table24[[#This Row],[Type Here]]=\"\",\"\",IF(Table24[[#This Row],[Type Here]]=Table24[[#This Row],[Answer]],1,-2))","v":""},{"$f":"IF($K$1=1,Table24[[#This Row],[Strength1]],Table24[[#This Row],[Strength2]])","v":7},{"$f":"IF($K$1=1,D316,G316)","v":"nature"},null,{"$f":"IF($K$1=1,IF(E316=\"\",\"\",E316),IF(H316=\"\",\"\",H316))","v":""},{"$f":"IF($K$1=1,G316,D316)","v":"die Natur"}]
[null,"40-Places",{"$f":"IF(AND(LEFT(D317,1)=\"d\",MID(D317,4,1)=\" \"),RIGHT(D317,LEN(D317)-4),D317)","v":"Schlösser"},"die Schlösser",null,0,"castles",null,-4,{"$f":"RAND()","v":0.7409007273983016},{"$f":"IF(Table24[[#This Row],[Type Here]]=\"\",\"\",IF(Table24[[#This Row],[Type Here]]=Table24[[#This Row],[Answer]],1,-2))","v":""},{"$f":"IF($K$1=1,Table24[[#This Row],[Strength1]],Table24[[#This Row],[Strength2]])","v":-4},{"$f":"IF($K$1=1,D317,G317)","v":"castles"},null,{"$f":"IF($K$1=1,IF(E317=\"\",\"\",E317),IF(H317=\"\",\"\",H317))","v":""},{"$f":"IF($K$1=1,G317,D317)","v":"die Schlösser"}]
[null,"38-Ad: Nom. 1",{"$f":"IF(AND(LEFT(D318,1)=\"d\",MID(D318,4,1)=\" \"),RIGHT(D318,LEN(D318)-4),D318)","v":"letzt"},"letzt",null,0,"last","(final)",4,{"$f":"RAND()","v":0.16793517163399918},{"$f":"IF(Table24[[#This Row],[Type Here]]=\"\",\"\",IF(Table24[[#This Row],[Type Here]]=Table24[[#This Row],[Answer]],1,-2))","v":""},{"$f":"IF($K$1=1,Table24[[#This Row],[Strength1]],Table24[[#This Row],[Strength2]])","v":4},{"$f":"IF($K$1=1,D318,G318)","v":"last"},null,{"$f":"IF($K$1=1,IF(E318=\"\",\"\",E318),IF(H318=\"\",\"\",H318))","v":"(final)"},{"$f":"IF($K$1=1,G318,D318)","v":"letzt"}]
[null,"14-Household",{"$f":"IF(AND(LEFT(D319,1)=\"d\",MID(D319,4,1)=\" \"),RIGHT(D319,LEN(D319)-4),D319)","v":"Keller"},"der Keller",null,0,"cellar",null,1,{"$f":"RAND()","v":0.6154846241641586},{"$f":"IF(Table24[[#This Row],[Type Here]]=\"\",\"\",IF(Table24[[#This Row],[Type Here]]=Table24[[#This Row],[Answer]],1,-2))","v":""},{"$f":"IF($K$1=1,Table24[[#This Row],[Strength1]],Table24[[#This Row],[Strength2]])","v":1},{"$f":"IF($K$1=1,D319,G319)","v":"cellar"},null,{"$f":"IF($K$1=1,IF(E319=\"\",\"\",E319),IF(H319=\"\",\"\",H319))","v":""},{"$f":"IF($K$1=1,G319,D319)","v":"der Keller"}]
[null,"29-Medical",{"$f":"IF(AND(LEFT(D320,1)=\"d\",MID(D320,4,1)=\" \"),RIGHT(D320,LEN(D320)-4),D320)","v":"Herz"},"das Herz",null,0,"heart",null,0,{"$f":"RAND()","v":0.36600468925401275},{"$f":"IF(Table24[[#This Row],[Type Here]]=\"\",\"\",IF(Table24[[#This Row],[Type Here]]=Table24[[#This Row],[Answer]],1,-2))","v":""},{"$f":"IF($K$1=1,Table24[[#This Row],[Strength1]],Table24[[#This Row],[Strength2]])","v":0},{"$f":"IF($K$1=1,D320,G320)","v":"heart"},null,{"$f":"IF($K$1=1,IF(E320=\"\",\"\",E320),IF(H320=\"\",\"\",H320))","v":""},{"$f":"IF($K$1=1,G320,D320)","v":"das Herz"}]
[null,"29-Medical",{"$f":"IF(AND(LEFT(D321,1)=\"d\",MID(D321,4,1)=\" \"),RIGHT(D321,LEN(D321)-4),D321)","v":"Hals"},"der Hals",null,0,"neck","anatomy",4,{"$f":"RAND()","v":0.7620525392042808},{"$f":"IF(Table24[[#This Row],[Type Here]]=\"\",\"\",IF(Table24[[#This Row],[Type Here]]=Table24[[#This Row],[Answer]],1,-2))","v":""},{"$f":"IF($K$1=1,Table24[[#This Row],[Strength1]],Table24[[#This Row],[Strength2]])","v":4},{"$f":"IF($K$1=1,D321,G321)","v":"neck"},null,{"$f":"IF($K$1=1,IF(E321=\"\",\"\",E321),IF(H321=\"\",\"\",H321))","v":"anatomy"},{"$f":"IF($K$1=1,G321,D321)","v":"der Hals"}]
[null,"29-Medical",{"$f":"IF(AND(LEFT(D322,1)=\"d\",MID(D322,4,1)=\" \"),RIGHT(D322,LEN(D322)-4),D322)","v":"Kopf"},"der Kopf",null,0,"head","anatomy",5,{"$f":"RAND()","v":0.6629203344544041},{"$f":"IF(Table24[[#This Row],[Type Here]]=\"\",\"\",IF(Table24[[#This Row],[Type Here]]=Table24[[#This Row],[Answer]],1,-2))","v":""},{"$f":"IF($K$1=1,Table24[[#This Row],[Strength1]],Table24[[#This Row],[Strength2]])","v":5},{"$f":"IF($K$1=1,D322,G322)","v":"head"},null,{"$f":"IF($K$1=1,IF(E322=\"\",\"\",E322),IF(H322=\"\",\"\",H322))","v":"anatomy"},{"$f":"IF($K$1=1,G322,D322)","v":"der Kopf"}]
[null,"01-Basics 1",{"$f":"IF(AND(LEFT(D323,1)=\"d\",MID(D323,4,1)=\" \"),RIGHT(D323,LEN(D323)-4),D323)","v":"sie"},"sie","3rd person singular",0,"she","Nom singular",1,{"$f":"RAND()","v":0.40402384994242224},{"$f":"IF(Table24[[#This Row],[Type Here]]=\"\",\"\",IF(Table24[[#This Row],[Type Here]]=Table24[[#This Row],[Answer]],1,-2))","v":""},{"$f":"IF($K$1=1,Table24[[#This Row],[Strength1]],Table24[[#This Row],[Strength2]])","v":1},{"$f":"IF($K$1=1,D323,G323)","v":"she"},null,{"$f":"IF($K$1=1,IF(E323=\"\",\"\",E323),IF(H323=\"\",\"\",H323))","v":"Nom singular"},{"$f":"IF($K$1=1,G323,D323)","v":"sie"}]
[null,"40-Places",{"$f":"IF(AND(LEFT(D324,1)=\"d\",MID(D324,4,1)=\" \"),RIGHT(D324,LEN(D324)-4),D324)","v":"Grundstück"},"das Grundstück",null,0,"plot of land",null,-2,{"$f":"RAND()","v":0.5302099950646085},{"$f":"IF(Table24[[#This Row],[Type Here]]=\"\",\"\",IF(Table24[[#This Row],[Type Here]]=Table24[[#This Row],[Answer]],1,-2))","v":""},{"$f":"IF($K$1=1,Table24[[#This Row],[Strength1]],Table24[[#This Row],[Strength2]])","v":-2},{"$f":"IF($K$1=1,D324,G324)","v":"plot of land"},null,{"$f":"IF($K$1=1,IF(E324=\"\",\"\",E324),IF(H324=\"\",\"\",H324))","v":""},{"$f":"IF($K$1=1,G324,D324)","v":"das Grundstück"}]
[null,"33-Adverbs 1",{"$f":"IF(AND(LEFT(D325,1)=\"d\",MID(D325,4,1)=\" \"),RIGHT(D325,LEN(D325)-4),D325)","v":"weder"},"weder",null,0,"neither",null,0,{"$f":"RAND()","v":0.5904295959823671},{"$f":"IF(Table24[[#This Row],[Type Here]]=\"\",\"\",IF(Table24[[#This Row],[Type Here]]=Table24[[#This Row],[Answer]],1,-2))","v":""},{"$f":"IF($K$1=1,Table24[[#This Row],[Strength1]],Table24[[#This Row],[Strength2]])","v":0},{"$f":"IF($K$1=1,D325,G325)","v":"neither"},null,{"$f":"IF($K$1=1,IF(E325=\"\",\"\",E325),IF(H325=\"\",\"\",H325))","v":""},{"$f":"IF($K$1=1,G325,D325)","v":"weder"}]
[null,"33-Adverbs 1",{"$f":"IF(AND(LEFT(D326,1)=\"d\",MID(D326,4,1)=\" \"),RIGHT(D326,LEN(D326)-4),D326)","v":"noch einmal"},"noch einmal","(do or have sth again)",0,"another","(do or have sth again)",0,{"$f":"RAND()","v":0.2980637916568898},{"$f":"IF(Table24[[#This Row],[Type Here]]=\"\",\"\",IF(Table24[[#This Row],[Type Here]]=Table24[[#This Row],[Answer]],1,-2))","v":""},{"$f":"IF($K$1=1,Table24[[#This Row],[Strength1]],Table24[[#This Row],[Strength2]])","v":0},{"$f":"IF($K$1=1,D326,G326)","v":"another"},null,{"$f":"IF($K$1=1,IF(E326=\"\",\"\",E326),IF(H326=\"\",\"\",H326))","v":"(do or have sth again)"},{"$f":"IF($K$1=1,G326,D326)","v":"noch einmal"}]
[null,"06-Plurals",{"$f":"IF(AND(LEFT(D327,1)=\"d\",MID(D327,4,1)=\" \"),RIGHT(D327,LEN(D327)-4),D327)","v":"Zeitungen"},"die Zeitungen",null,0,"newspapers",null,2,{"$f":"RAND()","v":0.2885846447666518},{"$f":"IF(Table24[[#This Row],[Type Here]]=\"\",\"\",IF(Table24[[#This Row],[Type Here]]=Table24[[#This Row],[Answer]],1,-2))","v":""},{"$f":"IF($K$1=1,Table24[[#This Row],[Strength1]],Table24[[#This Row],[Strength2]])","v":2},{"$f":"IF($K$1=1,D327,G327)","v":"newspapers"},null,{"$f":"IF($K$1=1,IF(E327=\"\",\"\",E327),IF(H327=\"\",\"\",H327))","v":""},{"$f":"IF($K$1=1,G327,D327)","v":"die Zeitungen"}]
[null,"03-Phrases",{"$f":"IF(AND(LEFT(D328,1)=\"d\",MID(D328,4,1)=\" \"),RIGHT(D328,LEN(D328)-4),D328)","v":"bitte"},"bitte",null,0,"please",null,1,{"$f":"RAND()","v":0.6112115950042087},{"$f":"IF(Table24[[#This Row],[Type Here]]=\"\",\"\",IF(Table24[[#This Row],[Type Here]]=Table24[[#This Row],[Answer]],1,-2))","v":""},{"$f":"IF($K$1=1,Table24[[#This Row],[Strength1]],Table24[[#This Row],[Strength2]])","v":1},{"$f":"IF($K$1=1,D328,G328)","v":"please"},null,{"$f":"IF($K$1=1,IF(E328=\"\",\"\",E328),IF(H328=\"\",\"\",H328))","v":""},{"$f":"IF($K$1=1,G328,D328)","v":"bitte"}]
[null,"40-Places",{"$f":"IF(AND(LEFT(D329,1)=\"d\",MID(D329,4,1)=\" \"),RIGHT(D329,LEN(D329)-4),D329)","v":"Straßen"},"die Straßen",null,0,"streets",null,5,{"$f":"RAND()","v":0.20906547289390665},{"$f":"IF(Table24[[#This Row],[Type Here]]=\"\",\"\",IF(Table24[[#This Row],[Type Here]]=Table24[[#This Row],[Answer]],1,-2))","v":""},{"$f":"IF($K$1=1,Table24[[#This Row],[Strength1]],Table24[[#This Row],[Strength2]])","v":5},{"$f":"IF($K$1=1,D329,G329)","v":"streets"},null,{"$f":"IF($K$1=1,IF(E329=\"\",\"\",E329),IF(H329=\"\",\"\",H329))","v":""},{"$f":"IF($K$1=1,G329,D329)","v":"die Straßen"}]
[null,"02-Basics 2",{"$f":"IF(AND(LEFT(D330,1)=\"d\",MID(D330,4,1)=\" \"),RIGHT(D330,LEN(D330)-4),D330)","v":"ich habe"},"ich habe",null,0,"I have",null,0,{"$f":"RAND()","v":0.703702818637942},{"$f":"IF(Table24[[#This Row],[Type Here]]=\"\",\"\",IF(Table24[[#This Row],[Type Here]]=Table24[[#This Row],[Answer]],1,-2))","v":""},{"$f":"IF($K$1=1,Table24[[#This Row],[Strength1]],Table24[[#This Row],[Strength2]])","v":0},{"$f":"IF($K$1=1,D330,G330)","v":"I have"},null,{"$f":"IF($K$1=1,IF(E330=\"\",\"\",E330),IF(H330=\"\",\"\",H330))","v":""},{"$f":"IF($K$1=1,G330,D330)","v":"ich habe"}]
[null,"40-Places",{"$f":"IF(AND(LEFT(D331,1)=\"d\",MID(D331,4,1)=\" \"),RIGHT(D331,LEN(D331)-4),D331)","v":"Pension"},"die Pension",null,0,"guest house","also, pension",0,{"$f":"RAND()","v":0.2662449918266475},{"$f":"IF(Table24[[#This Row],[Type Here]]=\"\",\"\",IF(Table24[[#This Row],[Type Here]]=Table24[[#This Row],[Answer]],1,-2))","v":""},{"$f":"IF($K$1=1,Table24[[#This Row],[Strength1]],Table24[[#This Row],[Strength2]])","v":0},{"$f":"IF($K$1=1,D331,G331)","v":"guest house"},null,{"$f":"IF($K$1=1,IF(E331=\"\",\"\",E331),IF(H331=\"\",\"\",H331))","v":"also, pension"},{"$f":"IF($K$1=1,G331,D331)","v":"die Pension"}]
[null,"38-Ad: Nom. 1",{"$f":"IF(AND(LEFT(D332,1)=\"d\",MID(D332,4,1)=\" \"),RIGHT(D332,LEN(D332)-4),D332)","v":"zufällig"},"zufällig",null,0,"accidental","(random)",3,{"$f":"RAND()","v":0.1947608437071645},{"$f":"IF(Table24[[#This Row],[Type Here]]=\"\",\"\",IF(Table24[[#This Row],[Type Here]]=Table24[[#This Row],[Answer]],1,-2))","v":""},{"$f":"IF($K$1=1,Table24[[#This Row],[Strength1]],Table24[[#This Row],[Strength2]])","v":3},{"$f":"IF($K$1=1,D332,G332)","v":"accidental"},null,{"$f":"IF($K$1=1,IF(E332=\"\",\"\",E332),IF(H332=\"\",\"\",H332))","v":"(random)"},{"$f":"IF($K$1=1,G332,D332)","v":"zufällig"}]
[null,"14-Household",{"$f":"IF(AND(LEFT(D333,1)=\"d\",MID(D333,4,1)=\" \"),RIGHT(D333,LEN(D333)-4),D333)","v":"Heizung"},"die Heizung",null,0,"heater",null,-2,{"$f":"RAND()","v":0.7389788770531263},{"$f":"IF(Table24[[#This Row],[Type Here]]=\"\",\"\",IF(Table24[[#This Row],[Type Here]]=Table24[[#This Row],[Answer]],1,-2))","v":""},{"$f":"IF($K$1=1,Table24[[#This Row],[Strength1]],Table24[[#This Row],[Strength2]])","v":-2},{"$f":"IF($K$1=1,D333,G333)","v":"heater"},null,{"$f":"IF($K$1=1,IF(E333=\"\",\"\",E333),IF(H333=\"\",\"\",H333))","v":""},{"$f":"IF($K$1=1,G333,D333)","v":"die Heizung"}]
[null,"29-Medical",{"$f":"IF(AND(LEFT(D334,1)=\"d\",MID(D334,4,1)=\" \"),RIGHT(D334,LEN(D334)-4),D334)","v":"Gesichter"},"die Gesichter",null,0,"faces","anatomy",0,{"$f":"RAND()","v":0.2555494784043121},{"$f":"IF(Table24[[#This Row],[Type Here]]=\"\",\"\",IF(Table24[[#This Row],[Type Here]]=Table24[[#This Row],[Answer]],1,-2))","v":""},{"$f":"IF($K$1=1,Table24[[#This Row],[Strength1]],Table24[[#This Row],[Strength2]])","v":0},{"$f":"IF($K$1=1,D334,G334)","v":"faces"},null,{"$f":"IF($K$1=1,IF(E334=\"\",\"\",E334),IF(H334=\"\",\"\",H334))","v":"anatomy"},{"$f":"IF($K$1=1,G334,D334)","v":"die Gesichter"}]
[null,"36-Nature",{"$f":"IF(AND(LEFT(D335,1)=\"d\",MID(D335,4,1)=\" \"),RIGHT(D335,LEN(D335)-4),D335)","v":"Wiese"},"die Wiese",null,0,"meadow",null,6,{"$f":"RAND()","v":0.8771139620811417},{"$f":"IF(Table24[[#This Row],[Type Here]]=\"\",\"\",IF(Table24[[#This Row],[Type Here]]=Table24[[#This Row],[Answer]],1,-2))","v":""},{"$f":"IF($K$1=1,Table24[[#This Row],[Strength1]],Table24[[#This Row],[Strength2]])","v":6},{"$f":"IF($K$1=1,D335,G335)","v":"meadow"},null,{"$f":"IF($K$1=1,IF(E335=\"\",\"\",E335),IF(H335=\"\",\"\",H335))","v":""},{"$f":"IF($K$1=1,G335,D335)","v":"die Wiese"}]
[null,"09-Clothing",{"$f":"IF(AND(LEFT(D336,1)=\"d\",MID(D336,4,1)=\" \"),RIGHT(D336,LEN(D336)-4),D336)","v":"Taschen"},"die Taschen",null,0,"pockets",null,1,{"$f":"RAND()","v":0.24996812147450886},{"$f":"IF(Table24[[#This Row],[Type Here]]=\"\",\"\",IF(Table24[[#This Row],[Type Here]]=Table24[[#This Row],[Answer]],1,-2))","v":""},{"$f":"IF($K$1=1,Table24[[#This Row],[Strength1]],Table24[[#This Row],[Strength2]])","v":1},{"$f":"IF($K$1=1,D336,G336)","v":"pockets"},null,{"$f":"IF($K$1=1,IF(E336=\"\",\"\",E336),IF(H336=\"\",\"\",H336))","v":""},{"$f":"IF($K$1=1,G336,D336)","v":"die Taschen"}]
[null,"10-Nom. Pron.",{"$f":"IF(AND(LEFT(D337,1)=\"d\",MID(D337,4,1)=\" \"),RIGHT(D337,LEN(D337)-4),D337)","v":"jemand"},"jemand",null,0,"someone",null,1,{"$f":"RAND()","v":0.9007878318639694},{"$f":"IF(Table24[[#This Row],[Type Here]]=\"\",\"\",IF(Table24[[#This Row],[Type Here]]=Table24[[#This Row],[Answer]],1,-2))","v":""},{"$f":"IF($K$1=1,Table24[[#This Row],[Strength1]],Table24[[#This Row],[Strength2]])","v":1},{"$f":"IF($K$1=1,D337,G337)","v":"someone"},null,{"$f":"IF($K$1=1,IF(E337=\"\",\"\",E337),IF(H337=\"\",\"\",H337))","v":""},{"$f":"IF($K$1=1,G337,D337)","v":"jemand"}]
[null,"04-Food",{"$f":"IF(AND(LEFT(D338,1)=\"d\",MID(D338,4,1)=\" \"),RIGHT(D338,LEN(D338)-4),D338)","v":"Hähnchen"},"das Hähnchen",null,0,"chicken",null,3,{"$f":"RAND()","v":0.01787134388060929},{"$f":"IF(Table24[[#This Row],[Type Here]]=\"\",\"\",IF(Table24[[#This Row],[Type Here]]=Table24[[#This Row],[Answer]],1,-2))","v":""},{"$f":"IF($K$1=1,Table24[[#This Row],[Strength1]],Table24[[#This Row],[Strength2]])","v":3},{"$f":"IF($K$1=1,D338,G338)","v":"chicken"},null,{"$f":"IF($K$1=1,IF(E338=\"\",\"\",E338),IF(H338=\"\",\"\",H338))","v":""},{"$f":"IF($K$1=1,G338,D338)","v":"das Hähnchen"}]
[null,"40-Places",{"$f":"IF(AND(LEFT(D339,1)=\"d\",MID(D339,4,1)=\" \"),RIGHT(D339,LEN(D339)-4),D339)","v":"Nähe"},"die Nähe",null,0,"vicinity",null,-2,{"$f":"RAND()","v":0.7601088635668538},{"$f":"IF(Table24[[#This Row],[Type Here]]=\"\",\"\",IF(Table24[[#This Row],[Type Here]]=Table24[[#This Row],[Answer]],1,-2))","v":""},{"$f":"IF($K$1=1,Table24[[#This Row],[Strength1]],Table24[[#This Row],[Strength2]])","v":-2},{"$f":"IF($K$1=1,D339,G339)","v":"vicinity"},null,{"$f":"IF($K$1=1,IF(E339=\"\",\"\",E339),IF(H339=\"\",\"\",H339))","v":""},{"$f":"IF($K$1=1,G339,D339)","v":"die Nähe"}]
[null,"40-Places",{"$f":"IF(AND(LEFT(D340,1)=\"d\",MID(D340,4,1)=\" \"),RIGHT(D340,LEN(D340)-4),D340)","v":"Hotels"},"die Hotels",null,0,"hotels",null,4,{"$f":"RAND()","v":0.18382244566556627},{"$f":"IF(Table24[[#This Row],[Type Here]]=\"\",\"\",IF(Table24[[#This Row],[Type Here]]=Table24[[#This Row],[Answer]],1,-2))","v":""},{"$f":"IF($K$1=1,Table24[[#This Row],[Strength1]],Table24[[#This Row],[Strength2]])","v":4},{"$f":"IF($K$1=1,D340,G340)","v":"hotels"},null,{"$f":"IF($K$1=1,IF(E340=\"\",\"\",E340),IF(H340=\"\",\"\",H340))","v":""},{"$f":"IF($K$1=1,G340,D340)","v":"die Hotels"}]
[null,"29-Medical",{"$f":"IF(AND(LEFT(D341,1)=\"d\",MID(D341,4,1)=\" \"),RIGHT(D341,LEN(D341)-4),D341)","v":"Fuß"},"der Fuß",null,0,"foot",null,0,{"$f":"RAND()","v":0.781048668087248},{"$f":"IF(Table24[[#This Row],[Type Here]]=\"\",\"\",IF(Table24[[#This Row],[Type Here]]=Table24[[#This Row],[Answer]],1,-2))","v":""},{"$f":"IF($K$1=1,Table24[[#This Row],[Strength1]],Table24[[#This Row],[Strength2]])","v":0},{"$f":"IF($K$1=1,D341,G341)","v":"foot"},null,{"$f":"IF($K$1=1,IF(E341=\"\",\"\",E341),IF(H341=\"\",\"\",H341))","v":""},{"$f":"IF($K$1=1,G341,D341)","v":"der Fuß"}]
[null,"09-Clothing",{"$f":"IF(AND(LEFT(D342,1)=\"d\",MID(D342,4,1)=\" \"),RIGHT(D342,LEN(D342)-4),D342)","v":"Kosmetik"},"die Kosmetik",null,0,"cosmetic",null,1,{"$f":"RAND()","v":0.2740719975987489},{"$f":"IF(Table24[[#This Row],[Type Here]]=\"\",\"\",IF(Table24[[#This Row],[Type Here]]=Table24[[#This Row],[Answer]],1,-2))","v":""},{"$f":"IF($K$1=1,Table24[[#This Row],[Strength1]],Table24[[#This Row],[Strength2]])","v":1},{"$f":"IF($K$1=1,D342,G342)","v":"cosmetic"},null,{"$f":"IF($K$1=1,IF(E342=\"\",\"\",E342),IF(H342=\"\",\"\",H342))","v":""},{"$f":"IF($K$1=1,G342,D342)","v":"die Kosmetik"}]
[null,"11-Family",{"$f":"IF(AND(LEFT(D343,1)=\"d\",MID(D343,4,1)=\" \"),RIGHT(D343,LEN(D343)-4),D343)","v":"Mutter"},"die Mutter",null,null,"mother",null,null,{"$f":"RAND()","v":0.745390225713052},{"$f":"IF(Table24[[#This Row],[Type Here]]=\"\",\"\",IF(Table24[[#This Row],[Type Here]]=Table24[[#This Row],[Answer]],1,-2))","v":""},{"$f":"IF($K$1=1,Table24[[#This Row],[Strength1]],Table24[[#This Row],[Strength2]])","v":0},{"$f":"IF($K$1=1,D343,G343)","v":"mother"},null,{"$f":"IF($K$1=1,IF(E343=\"\",\"\",E343),IF(H343=\"\",\"\",H343))","v":""},{"$f":"IF($K$1=1,G343,D343)","v":"die Mutter"}]
[null,"05-Animals",{"$f":"IF(AND(LEFT(D344,1)=\"d\",MID(D344,4,1)=\" \"),RIGHT(D344,LEN(D344)-4),D344)","v":"Maus"},"die Maus",null,0,"mouse",null,1,{"$f":"RAND()","v":0.7080293807429638},{"$f":"IF(Table24[[#This Row],[Type Here]]=\"\",\"\",IF(Table24[[#This Row],[Type Here]]=Table24[[#This Row],[Answer]],1,-2))","v":""},{"$f":"IF($K$1=1,Table24[[#This Row],[Strength1]],Table24[[#This Row],[Strength2]])","v":1},{"$f":"IF($K$1=1,D344,G344)","v":"mouse"},null,{"$f":"IF($K$1=1,IF(E344=\"\",\"\",E344),IF(H344=\"\",\"\",H344))","v":""},{"$f":"IF($K$1=1,G344,D344)","v":"die Maus"}]
[null,"07-Adjectives",{"$f":"IF(AND(LEFT(D345,1)=\"d\",MID(D345,4,1)=\" \"),RIGHT(D345,LEN(D345)-4),D345)","v":"gesund"},"gesund",null,0,"healthy",null,0,{"$f":"RAND()","v":0.8958999462879637},{"$f":"IF(Table24[[#This Row],[Type Here]]=\"\",\"\",IF(Table24[[#This Row],[Type Here]]=Table24[[#This Row],[Answer]],1,-2))","v":""},{"$f":"IF($K$1=1,Table24[[#This Row],[Strength1]],Table24[[#This Row],[Strength2]])","v":0},{"$f":"IF($K$1=1,D345,G345)","v":"healthy"},null,{"$f":"IF($K$1=1,IF(E345=\"\",\"\",E345),IF(H345=\"\",\"\",H345))","v":""},{"$f":"IF($K$1=1,G345,D345)","v":"gesund"}]
[null,"04-Food",{"$f":"IF(AND(LEFT(D346,1)=\"d\",MID(D346,4,1)=\" \"),RIGHT(D346,LEN(D346)-4),D346)","v":"Wein"},"der Wein",null,0,"wine",null,4,{"$f":"RAND()","v":0.3852163383185845},{"$f":"IF(Table24[[#This Row],[Type Here]]=\"\",\"\",IF(Table24[[#This Row],[Type Here]]=Table24[[#This Row],[Answer]],1,-2))","v":""},{"$f":"IF($K$1=1,Table24[[#This Row],[Strength1]],Table24[[#This Row],[Strength2]])","v":4},{"$f":"IF($K$1=1,D346,G346)","v":"wine"},null,{"$f":"IF($K$1=1,IF(E346=\"\",\"\",E346),IF(H346=\"\",\"\",H346))","v":""},{"$f":"IF($K$1=1,G346,D346)","v":"der Wein"}]
[null,"14-Household",{"$f":"IF(AND(LEFT(D347,1)=\"d\",MID(D347,4,1)=\" \"),RIGHT(D347,LEN(D347)-4),D347)","v":"Haushaltgerät"},"das Haushaltgerät",null,0,"household appliance",null,0,{"$f":"RAND()","v":0.5911083782258596},{"$f":"IF(Table24[[#This Row],[Type Here]]=\"\",\"\",IF(Table24[[#This Row],[Type Here]]=Table24[[#This Row],[Answer]],1,-2))","v":""},{"$f":"IF($K$1=1,Table24[[#This Row],[Strength1]],Table24[[#This Row],[Strength2]])","v":0},{"$f":"IF($K$1=1,D347,G347)","v":"household appliance"},null,{"$f":"IF($K$1=1,IF(E347=\"\",\"\",E347),IF(H347=\"\",\"\",H347))","v":""},{"$f":"IF($K$1=1,G347,D347)","v":"das Haushaltgerät"}]
[null,"08-V. Pres. 1",{"$f":"IF(AND(LEFT(D348,1)=\"d\",MID(D348,4,1)=\" \"),RIGHT(D348,LEN(D348)-4),D348)","v":"schreiben"},"schreiben",null,0,"to write",null,0,{"$f":"RAND()","v":0.17180935270183273},{"$f":"IF(Table24[[#This Row],[Type Here]]=\"\",\"\",IF(Table24[[#This Row],[Type Here]]=Table24[[#This Row],[Answer]],1,-2))","v":""},{"$f":"IF($K$1=1,Table24[[#This Row],[Strength1]],Table24[[#This Row],[Strength2]])","v":0},{"$f":"IF($K$1=1,D348,G348)","v":"to write"},null,{"$f":"IF($K$1=1,IF(E348=\"\",\"\",E348),IF(H348=\"\",\"\",H348))","v":""},{"$f":"IF($K$1=1,G348,D348)","v":"schreiben"}]
[null,"36-Nature",{"$f":"IF(AND(LEFT(D349,1)=\"d\",MID(D349,4,1)=\" \"),RIGHT(D349,LEN(D349)-4),D349)","v":"Meer"},"das Meer",null,0,"sea",null,7,{"$f":"RAND()","v":0.541703484121193},{"$f":"IF(Table24[[#This Row],[Type Here]]=\"\",\"\",IF(Table24[[#This Row],[Type Here]]=Table24[[#This Row],[Answer]],1,-2))","v":""},{"$f":"IF($K$1=1,Table24[[#This Row],[Strength1]],Table24[[#This Row],[Strength2]])","v":7},{"$f":"IF($K$1=1,D349,G349)","v":"sea"},null,{"$f":"IF($K$1=1,IF(E349=\"\",\"\",E349),IF(H349=\"\",\"\",H349))","v":""},{"$f":"IF($K$1=1,G349,D349)","v":"das Meer"}]
[null,"08-V. Pres. 1",{"$f":"IF(AND(LEFT(D350,1)=\"d\",MID(D350,4,1)=\" \"),RIGHT(D350,LEN(D350)-4),D350)","v":"brauchen"},"brauchen",null,0,"to need",null,0,{"$f":"RAND()","v":0.7804054314968609},{"$f":"IF(Table24[[#This Row],[Type Here]]=\"\",\"\",IF(Table24[[#This Row],[Type Here]]=Table24[[#This Row],[Answer]],1,-2))","v":""},{"$f":"IF($K$1=1,Table24[[#This Row],[Strength1]],Table24[[#This Row],[Strength2]])","v":0},{"$f":"IF($K$1=1,D350,G350)","v":"to need"},null,{"$f":"IF($K$1=1,IF(E350=\"\",\"\",E350),IF(H350=\"\",\"\",H350))","v":""},{"$f":"IF($K$1=1,G350,D350)","v":"brauchen"}]
[null,"08-V. Pres. 1",{"$f":"IF(AND(LEFT(D351,1)=\"d\",MID(D351,4,1)=\" \"),RIGHT(D351,LEN(D351)-4),D351)","v":"beginnen"},"beginnen",null,0,"to begin",null,0,{"$f":"RAND()","v":0.4233886213424298},{"$f":"IF(Table24[[#This Row],[Type Here]]=\"\",\"\",IF(Table24[[#This Row],[Type Here]]=Table24[[#This Row],[Answer]],1,-2))","v":""},{"$f":"IF($K$1=1,Table24[[#This Row],[Strength1]],Table24[[#This Row],[Strength2]])","v":0},{"$f":"IF($K$1=1,D351,G351)","v":"to begin"},null,{"$f":"IF($K$1=1,IF(E351=\"\",\"\",E351),IF(H351=\"\",\"\",H351))","v":""},{"$f":"IF($K$1=1,G351,D351)","v":"beginnen"}]
[null,"07-Adjectives",{"$f":"IF(AND(LEFT(D352,1)=\"d\",MID(D352,4,1)=\" \"),RIGHT(D352,LEN(D352)-4),D352)","v":"kurz"},"kurz",null,0,"short",null,0,{"$f":"RAND()","v":0.34308022620778666},{"$f":"IF(Table24[[#This Row],[Type Here]]=\"\",\"\",IF(Table24[[#This Row],[Type Here]]=Table24[[#This Row],[Answer]],1,-2))","v":""},{"$f":"IF($K$1=1,Table24[[#This Row],[Strength1]],Table24[[#This Row],[Strength2]])","v":0},{"$f":"IF($K$1=1,D352,G352)","v":"short"},null,{"$f":"IF($K$1=1,IF(E352=\"\",\"\",E352),IF(H352=\"\",\"\",H352))","v":""},{"$f":"IF($K$1=1,G352,D352)","v":"kurz"}]
[null,"05-Animals",{"$f":"IF(AND(LEFT(D353,1)=\"d\",MID(D353,4,1)=\" \"),RIGHT(D353,LEN(D353)-4),D353)","v":"Bären"},"die Bären",null,0,"bears",null,0,{"$f":"RAND()","v":0.6824859971455425},{"$f":"IF(Table24[[#This Row],[Type Here]]=\"\",\"\",IF(Table24[[#This Row],[Type Here]]=Table24[[#This Row],[Answer]],1,-2))","v":""},{"$f":"IF($K$1=1,Table24[[#This Row],[Strength1]],Table24[[#This Row],[Strength2]])","v":0},{"$f":"IF($K$1=1,D353,G353)","v":"bears"},null,{"$f":"IF($K$1=1,IF(E353=\"\",\"\",E353),IF(H353=\"\",\"\",H353))","v":""},{"$f":"IF($K$1=1,G353,D353)","v":"die Bären"}]
[null,"04-Food",{"$f":"IF(AND(LEFT(D354,1)=\"d\",MID(D354,4,1)=\" \"),RIGHT(D354,LEN(D354)-4),D354)","v":"Bier"},"das Bier",null,0,"beer",null,0,{"$f":"RAND()","v":0.4704084756567729},{"$f":"IF(Table24[[#This Row],[Type Here]]=\"\",\"\",IF(Table24[[#This Row],[Type Here]]=Table24[[#This Row],[Answer]],1,-2))","v":""},{"$f":"IF($K$1=1,Table24[[#This Row],[Strength1]],Table24[[#This Row],[Strength2]])","v":0},{"$f":"IF($K$1=1,D354,G354)","v":"beer"},null,{"$f":"IF($K$1=1,IF(E354=\"\",\"\",E354),IF(H354=\"\",\"\",H354))","v":""},{"$f":"IF($K$1=1,G354,D354)","v":"das Bier"}]
[null,"29-Medical",{"$f":"IF(AND(LEFT(D355,1)=\"d\",MID(D355,4,1)=\" \"),RIGHT(D355,LEN(D355)-4),D355)","v":"Finger"},"der Finger",null,0,"finger",null,5,{"$f":"RAND()","v":0.46526937528426726},{"$f":"IF(Table24[[#This Row],[Type Here]]=\"\",\"\",IF(Table24[[#This Row],[Type Here]]=Table24[[#This Row],[Answer]],1,-2))","v":""},{"$f":"IF($K$1=1,Table24[[#This Row],[Strength1]],Table24[[#This Row],[Strength2]])","v":5},{"$f":"IF($K$1=1,D355,G355)","v":"finger"},null,{"$f":"IF($K$1=1,IF(E355=\"\",\"\",E355),IF(H355=\"\",\"\",H355))","v":""},{"$f":"IF($K$1=1,G355,D355)","v":"der Finger"}]
[null,"10-Nom. Pron.",{"$f":"IF(AND(LEFT(D356,1)=\"d\",MID(D356,4,1)=\" \"),RIGHT(D356,LEN(D356)-4),D356)","v":"unser"},"unser",null,0,"ours",null,1,{"$f":"RAND()","v":0.1087283578957694},{"$f":"IF(Table24[[#This Row],[Type Here]]=\"\",\"\",IF(Table24[[#This Row],[Type Here]]=Table24[[#This Row],[Answer]],1,-2))","v":""},{"$f":"IF($K$1=1,Table24[[#This Row],[Strength1]],Table24[[#This Row],[Strength2]])","v":1},{"$f":"IF($K$1=1,D356,G356)","v":"ours"},null,{"$f":"IF($K$1=1,IF(E356=\"\",\"\",E356),IF(H356=\"\",\"\",H356))","v":""},{"$f":"IF($K$1=1,G356,D356)","v":"unser"}]
[null,"12-Acc. Pron.",{"$f":"IF(AND(LEFT(D357,1)=\"d\",MID(D357,4,1)=\" \"),RIGHT(D357,LEN(D357)-4),D357)","v":"sie"},"sie","Acc pronoun",null,"they","Acc pronoun",null,{"$f":"RAND()","v":0.6760631979945482},{"$f":"IF(Table24[[#This Row],[Type Here]]=\"\",\"\",IF(Table24[[#This Row],[Type Here]]=Table24[[#This Row],[Answer]],1,-2))","v":""},{"$f":"IF($K$1=1,Table24[[#This Row],[Strength1]],Table24[[#This Row],[Strength2]])","v":0},{"$f":"IF($K$1=1,D357,G357)","v":"they"},null,{"$f":"IF($K$1=1,IF(E357=\"\",\"\",E357),IF(H357=\"\",\"\",H357))","v":"Acc pronoun"},{"$f":"IF($K$1=1,G357,D357)","v":"sie"}]
[null,"04-Food",{"$f":"IF(AND(LEFT(D358,1)=\"d\",MID(D358,4,1)=\" \"),RIGHT(D358,LEN(D358)-4),D358)","v":"sauer"},"sauer","(the taste)",0,"sour",null,4,{"$f":"RAND()","v":0.18880811811231946},{"$f":"IF(Table24[[#This Row],[Type Here]]=\"\",\"\",IF(Table24[[#This Row],[Type Here]]=Table24[[#This Row],[Answer]],1,-2))","v":""},{"$f":"IF($K$1=1,Table24[[#This Row],[Strength1]],Table24[[#This Row],[Strength2]])","v":4},{"$f":"IF($K$1=1,D358,G358)","v":"sour"},null,{"$f":"IF($K$1=1,IF(E358=\"\",\"\",E358),IF(H358=\"\",\"\",H358))","v":""},{"$f":"IF($K$1=1,G358,D358)","v":"sauer"}]
[null,"02-Basics 2",{"$f":"IF(AND(LEFT(D359,1)=\"d\",MID(D359,4,1)=\" \"),RIGHT(D359,LEN(D359)-4),D359)","v":"ihr esst"},"ihr esst",null,0,"you eat","informal plural",1,{"$f":"RAND()","v":0.32096812095724137},{"$f":"IF(Table24[[#This Row],[Type Here]]=\"\",\"\",IF(Table24[[#This Row],[Type Here]]=Table24[[#This Row],[Answer]],1,-2))","v":""},{"$f":"IF($K$1=1,Table24[[#This Row],[Strength1]],Table24[[#This Row],[Strength2]])","v":1},{"$f":"IF($K$1=1,D359,G359)","v":"you eat"},null,{"$f":"IF($K$1=1,IF(E359=\"\",\"\",E359),IF(H359=\"\",\"\",H359))","v":"informal plural"},{"$f":"IF($K$1=1,G359,D359)","v":"ihr esst"}]
[null,"07-Adjectives",{"$f":"IF(AND(LEFT(D360,1)=\"d\",MID(D360,4,1)=\" \"),RIGHT(D360,LEN(D360)-4),D360)","v":"gemeinsam"},"gemeinsam",null,0,"shared","(in common, mutual)",9,{"$f":"RAND()","v":0.17951618242235345},{"$f":"IF(Table24[[#This Row],[Type Here]]=\"\",\"\",IF(Table24[[#This Row],[Type Here]]=Table24[[#This Row],[Answer]],1,-2))","v":""},{"$f":"IF($K$1=1,Table24[[#This Row],[Strength1]],Table24[[#This Row],[Strength2]])","v":9},{"$f":"IF($K$1=1,D360,G360)","v":"shared"},null,{"$f":"IF($K$1=1,IF(E360=\"\",\"\",E360),IF(H360=\"\",\"\",H360))","v":"(in common, mutual)"},{"$f":"IF($K$1=1,G360,D360)","v":"gemeinsam"}]
[null,"05-Animals",{"$f":"IF(AND(LEFT(D361,1)=\"d\",MID(D361,4,1)=\" \"),RIGHT(D361,LEN(D361)-4),D361)","v":"Vogel"},"der Vogel",null,0,"bird",null,0,{"$f":"RAND()","v":0.14194524564450917},{"$f":"IF(Table24[[#This Row],[Type Here]]=\"\",\"\",IF(Table24[[#This Row],[Type Here]]=Table24[[#This Row],[Answer]],1,-2))","v":""},{"$f":"IF($K$1=1,Table24[[#This Row],[Strength1]],Table24[[#This Row],[Strength2]])","v":0},{"$f":"IF($K$1=1,D361,G361)","v":"bird"},null,{"$f":"IF($K$1=1,IF(E361=\"\",\"\",E361),IF(H361=\"\",\"\",H361))","v":""},{"$f":"IF($K$1=1,G361,D361)","v":"der Vogel"}]
[null,"01-Basics 1",{"$f":"IF(AND(LEFT(D362,1)=\"d\",MID(D362,4,1)=\" \"),RIGHT(D362,LEN(D362)-4),D362)","v":"eine"},"eine","(article - Acc fem)",0,"a","Acc fem",0,{"$f":"RAND()","v":0.021818019307508152},{"$f":"IF(Table24[[#This Row],[Type Here]]=\"\",\"\",IF(Table24[[#This Row],[Type Here]]=Table24[[#This Row],[Answer]],1,-2))","v":""},{"$f":"IF($K$1=1,Table24[[#This Row],[Strength1]],Table24[[#This Row],[Strength2]])","v":0},{"$f":"IF($K$1=1,D362,G362)","v":"a"},null,{"$f":"IF($K$1=1,IF(E362=\"\",\"\",E362),IF(H362=\"\",\"\",H362))","v":"Acc fem"},{"$f":"IF($K$1=1,G362,D362)","v":"eine"}]
[null,"39-Adj: Acc.",{"$f":"IF(AND(LEFT(D363,1)=\"d\",MID(D363,4,1)=\" \"),RIGHT(D363,LEN(D363)-4),D363)","v":"nahe"},"nahe",null,0,"near",null,11,{"$f":"RAND()","v":0.35717835842915346},{"$f":"IF(Table24[[#This Row],[Type Here]]=\"\",\"\",IF(Table24[[#This Row],[Type Here]]=Table24[[#This Row],[Answer]],1,-2))","v":""},{"$f":"IF($K$1=1,Table24[[#This Row],[Strength1]],Table24[[#This Row],[Strength2]])","v":11},{"$f":"IF($K$1=1,D363,G363)","v":"near"},null,{"$f":"IF($K$1=1,IF(E363=\"\",\"\",E363),IF(H363=\"\",\"\",H363))","v":""},{"$f":"IF($K$1=1,G363,D363)","v":"nahe"}]
[null,"29-Medical",{"$f":"IF(AND(LEFT(D364,1)=\"d\",MID(D364,4,1)=\" \"),RIGHT(D364,LEN(D364)-4),D364)","v":"Krankenhäuser"},"die Krankenhäuser",null,0,"hospitals",null,5,{"$f":"RAND()","v":0.8069097633166847},{"$f":"IF(Table24[[#This Row],[Type Here]]=\"\",\"\",IF(Table24[[#This Row],[Type Here]]=Table24[[#This Row],[Answer]],1,-2))","v":""},{"$f":"IF($K$1=1,Table24[[#This Row],[Strength1]],Table24[[#This Row],[Strength2]])","v":5},{"$f":"IF($K$1=1,D364,G364)","v":"hospitals"},null,{"$f":"IF($K$1=1,IF(E364=\"\",\"\",E364),IF(H364=\"\",\"\",H364))","v":""},{"$f":"IF($K$1=1,G364,D364)","v":"die Krankenhäuser"}]
[null,"14-Household",{"$f":"IF(AND(LEFT(D365,1)=\"d\",MID(D365,4,1)=\" \"),RIGHT(D365,LEN(D365)-4),D365)","v":"Küche"},"die Küche",null,0,"kitchen",null,1,{"$f":"RAND()","v":0.4100132587680777},{"$f":"IF(Table24[[#This Row],[Type Here]]=\"\",\"\",IF(Table24[[#This Row],[Type Here]]=Table24[[#This Row],[Answer]],1,-2))","v":""},{"$f":"IF($K$1=1,Table24[[#This Row],[Strength1]],Table24[[#This Row],[Strength2]])","v":1},{"$f":"IF($K$1=1,D365,G365)","v":"kitchen"},null,{"$f":"IF($K$1=1,IF(E365=\"\",\"\",E365),IF(H365=\"\",\"\",H365))","v":""},{"$f":"IF($K$1=1,G365,D365)","v":"die Küche"}]
[null,"14-Household",{"$f":"IF(AND(LEFT(D366,1)=\"d\",MID(D366,4,1)=\" \"),RIGHT(D366,LEN(D366)-4),D366)","v":"Tasse"},"die Tasse",null,0,"cup",null,1,{"$f":"RAND()","v":0.7878760563146427},{"$f":"IF(Table24[[#This Row],[Type Here]]=\"\",\"\",IF(Table24[[#This Row],[Type Here]]=Table24[[#This Row],[Answer]],1,-2))","v":""},{"$f":"IF($K$1=1,Table24[[#This Row],[Strength1]],Table24[[#This Row],[Strength2]])","v":1},{"$f":"IF($K$1=1,D366,G366)","v":"cup"},null,{"$f":"IF($K$1=1,IF(E366=\"\",\"\",E366),IF(H366=\"\",\"\",H366))","v":""},{"$f":"IF($K$1=1,G366,D366)","v":"die Tasse"}]
[null,"02-Basics 2",{"$f":"IF(AND(LEFT(D367,1)=\"d\",MID(D367,4,1)=\" \"),RIGHT(D367,LEN(D367)-4),D367)","v":"Frauen"},"die Frauen","(spouses)",0,"wives",null,0,{"$f":"RAND()","v":0.3159010545506914},{"$f":"IF(Table24[[#This Row],[Type Here]]=\"\",\"\",IF(Table24[[#This Row],[Type Here]]=Table24[[#This Row],[Answer]],1,-2))","v":""},{"$f":"IF($K$1=1,Table24[[#This Row],[Strength1]],Table24[[#This Row],[Strength2]])","v":0},{"$f":"IF($K$1=1,D367,G367)","v":"wives"},null,{"$f":"IF($K$1=1,IF(E367=\"\",\"\",E367),IF(H367=\"\",\"\",H367))","v":""},{"$f":"IF($K$1=1,G367,D367)","v":"die Frauen"}]
[null,"14-Household",{"$f":"IF(AND(LEFT(D368,1)=\"d\",MID(D368,4,1)=\" \"),RIGHT(D368,LEN(D368)-4),D368)","v":"Schlafzimmer"},"die Schlafzimmer",null,0,"bedrooms",null,3,{"$f":"RAND()","v":0.3108265721774244},{"$f":"IF(Table24[[#This Row],[Type Here]]=\"\",\"\",IF(Table24[[#This Row],[Type Here]]=Table24[[#This Row],[Answer]],1,-2))","v":""},{"$f":"IF($K$1=1,Table24[[#This Row],[Strength1]],Table24[[#This Row],[Strength2]])","v":3},{"$f":"IF($K$1=1,D368,G368)","v":"bedrooms"},null,{"$f":"IF($K$1=1,IF(E368=\"\",\"\",E368),IF(H368=\"\",\"\",H368))","v":""},{"$f":"IF($K$1=1,G368,D368)","v":"die Schlafzimmer"}]
[null,"36-Nature",{"$f":"IF(AND(LEFT(D369,1)=\"d\",MID(D369,4,1)=\" \"),RIGHT(D369,LEN(D369)-4),D369)","v":"Naturen"},"die Naturen","(characters, temprements)",0,"natures",null,4,{"$f":"RAND()","v":0.15240090001642104},{"$f":"IF(Table24[[#This Row],[Type Here]]=\"\",\"\",IF(Table24[[#This Row],[Type Here]]=Table24[[#This Row],[Answer]],1,-2))","v":""},{"$f":"IF($K$1=1,Table24[[#This Row],[Strength1]],Table24[[#This Row],[Strength2]])","v":4},{"$f":"IF($K$1=1,D369,G369)","v":"natures"},null,{"$f":"IF($K$1=1,IF(E369=\"\",\"\",E369),IF(H369=\"\",\"\",H369))","v":""},{"$f":"IF($K$1=1,G369,D369)","v":"die Naturen"}]
[null,"06-Plurals",{"$f":"IF(AND(LEFT(D370,1)=\"d\",MID(D370,4,1)=\" \"),RIGHT(D370,LEN(D370)-4),D370)","v":"Äpfel"},"die Äpfel",null,0,"apples",null,0,{"$f":"RAND()","v":0.9408127943659828},{"$f":"IF(Table24[[#This Row],[Type Here]]=\"\",\"\",IF(Table24[[#This Row],[Type Here]]=Table24[[#This Row],[Answer]],1,-2))","v":""},{"$f":"IF($K$1=1,Table24[[#This Row],[Strength1]],Table24[[#This Row],[Strength2]])","v":0},{"$f":"IF($K$1=1,D370,G370)","v":"apples"},null,{"$f":"IF($K$1=1,IF(E370=\"\",\"\",E370),IF(H370=\"\",\"\",H370))","v":""},{"$f":"IF($K$1=1,G370,D370)","v":"die Äpfel"}]
[null,"07-Adjectives",{"$f":"IF(AND(LEFT(D371,1)=\"d\",MID(D371,4,1)=\" \"),RIGHT(D371,LEN(D371)-4),D371)","v":"praktisch"},"praktisch",null,0,"practical",null,0,{"$f":"RAND()","v":0.09090110347602043},{"$f":"IF(Table24[[#This Row],[Type Here]]=\"\",\"\",IF(Table24[[#This Row],[Type Here]]=Table24[[#This Row],[Answer]],1,-2))","v":""},{"$f":"IF($K$1=1,Table24[[#This Row],[Strength1]],Table24[[#This Row],[Strength2]])","v":0},{"$f":"IF($K$1=1,D371,G371)","v":"practical"},null,{"$f":"IF($K$1=1,IF(E371=\"\",\"\",E371),IF(H371=\"\",\"\",H371))","v":""},{"$f":"IF($K$1=1,G371,D371)","v":"praktisch"}]
[null,"14-Household",{"$f":"IF(AND(LEFT(D372,1)=\"d\",MID(D372,4,1)=\" \"),RIGHT(D372,LEN(D372)-4),D372)","v":"Spiegel"},"die Spiegel",null,0,"mirrors",null,0,{"$f":"RAND()","v":0.287539930545047},{"$f":"IF(Table24[[#This Row],[Type Here]]=\"\",\"\",IF(Table24[[#This Row],[Type Here]]=Table24[[#This Row],[Answer]],1,-2))","v":""},{"$f":"IF($K$1=1,Table24[[#This Row],[Strength1]],Table24[[#This Row],[Strength2]])","v":0},{"$f":"IF($K$1=1,D372,G372)","v":"mirrors"},null,{"$f":"IF($K$1=1,IF(E372=\"\",\"\",E372),IF(H372=\"\",\"\",H372))","v":""},{"$f":"IF($K$1=1,G372,D372)","v":"die Spiegel"}]
[null,"01-Basics 1",{"$f":"IF(AND(LEFT(D373,1)=\"d\",MID(D373,4,1)=\" \"),RIGHT(D373,LEN(D373)-4),D373)","v":"Frau"},"die Frau","(spouse)",0,"wife",null,0,{"$f":"RAND()","v":0.1291635308438167},{"$f":"IF(Table24[[#This Row],[Type Here]]=\"\",\"\",IF(Table24[[#This Row],[Type Here]]=Table24[[#This Row],[Answer]],1,-2))","v":""},{"$f":"IF($K$1=1,Table24[[#This Row],[Strength1]],Table24[[#This Row],[Strength2]])","v":0},{"$f":"IF($K$1=1,D373,G373)","v":"wife"},null,{"$f":"IF($K$1=1,IF(E373=\"\",\"\",E373),IF(H373=\"\",\"\",H373))","v":""},{"$f":"IF($K$1=1,G373,D373)","v":"die Frau"}]
[null,"11-Family",{"$f":"IF(AND(LEFT(D374,1)=\"d\",MID(D374,4,1)=\" \"),RIGHT(D374,LEN(D374)-4),D374)","v":"Väter"},"die Väter",null,null,"fathers",null,null,{"$f":"RAND()","v":0.9387365936298122},{"$f":"IF(Table24[[#This Row],[Type Here]]=\"\",\"\",IF(Table24[[#This Row],[Type Here]]=Table24[[#This Row],[Answer]],1,-2))","v":""},{"$f":"IF($K$1=1,Table24[[#This Row],[Strength1]],Table24[[#This Row],[Strength2]])","v":0},{"$f":"IF($K$1=1,D374,G374)","v":"fathers"},null,{"$f":"IF($K$1=1,IF(E374=\"\",\"\",E374),IF(H374=\"\",\"\",H374))","v":""},{"$f":"IF($K$1=1,G374,D374)","v":"die Väter"}]
[null,"04-Food",{"$f":"IF(AND(LEFT(D375,1)=\"d\",MID(D375,4,1)=\" \"),RIGHT(D375,LEN(D375)-4),D375)","v":"Rezept"},"das Rezept",null,0,"recipe",null,-2,{"$f":"RAND()","v":0.31042512215618645},{"$f":"IF(Table24[[#This Row],[Type Here]]=\"\",\"\",IF(Table24[[#This Row],[Type Here]]=Table24[[#This Row],[Answer]],1,-2))","v":""},{"$f":"IF($K$1=1,Table24[[#This Row],[Strength1]],Table24[[#This Row],[Strength2]])","v":-2},{"$f":"IF($K$1=1,D375,G375)","v":"recipe"},null,{"$f":"IF($K$1=1,IF(E375=\"\",\"\",E375),IF(H375=\"\",\"\",H375))","v":""},{"$f":"IF($K$1=1,G375,D375)","v":"das Rezept"}]
[null,"14-Household",{"$f":"IF(AND(LEFT(D376,1)=\"d\",MID(D376,4,1)=\" \"),RIGHT(D376,LEN(D376)-4),D376)","v":"Haushaltgeräte"},"die Haushaltgeräte",null,0,"household appliances",null,0,{"$f":"RAND()","v":0.40692433998174926},{"$f":"IF(Table24[[#This Row],[Type Here]]=\"\",\"\",IF(Table24[[#This Row],[Type Here]]=Table24[[#This Row],[Answer]],1,-2))","v":""},{"$f":"IF($K$1=1,Table24[[#This Row],[Strength1]],Table24[[#This Row],[Strength2]])","v":0},{"$f":"IF($K$1=1,D376,G376)","v":"household appliances"},null,{"$f":"IF($K$1=1,IF(E376=\"\",\"\",E376),IF(H376=\"\",\"\",H376))","v":""},{"$f":"IF($K$1=1,G376,D376)","v":"die Haushaltgeräte"}]
[null,"12-Acc. Pron.",{"$f":"IF(AND(LEFT(D377,1)=\"d\",MID(D377,4,1)=\" \"),RIGHT(D377,LEN(D377)-4),D377)","v":"unser"},"unser","Acc pronoun",null,"our","Acc pronoun",null,{"$f":"RAND()","v":0.6207202541076305},{"$f":"IF(Table24[[#This Row],[Type Here]]=\"\",\"\",IF(Table24[[#This Row],[Type Here]]=Table24[[#This Row],[Answer]],1,-2))","v":""},{"$f":"IF($K$1=1,Table24[[#This Row],[Strength1]],Table24[[#This Row],[Strength2]])","v":0},{"$f":"IF($K$1=1,D377,G377)","v":"our"},null,{"$f":"IF($K$1=1,IF(E377=\"\",\"\",E377),IF(H377=\"\",\"\",H377))","v":"Acc pronoun"},{"$f":"IF($K$1=1,G377,D377)","v":"unser"}]
[null,"07-Adjectives",{"$f":"IF(AND(LEFT(D378,1)=\"d\",MID(D378,4,1)=\" \"),RIGHT(D378,LEN(D378)-4),D378)","v":"normal"},"normal",null,0,"normal","(ordinary, regular)",3,{"$f":"RAND()","v":0.2240217994696515},{"$f":"IF(Table24[[#This Row],[Type Here]]=\"\",\"\",IF(Table24[[#This Row],[Type Here]]=Table24[[#This Row],[Answer]],1,-2))","v":""},{"$f":"IF($K$1=1,Table24[[#This Row],[Strength1]],Table24[[#This Row],[Strength2]])","v":3},{"$f":"IF($K$1=1,D378,G378)","v":"normal"},null,{"$f":"IF($K$1=1,IF(E378=\"\",\"\",E378),IF(H378=\"\",\"\",H378))","v":"(ordinary, regular)"},{"$f":"IF($K$1=1,G378,D378)","v":"normal"}]
[null,"09-Clothing",{"$f":"IF(AND(LEFT(D379,1)=\"d\",MID(D379,4,1)=\" \"),RIGHT(D379,LEN(D379)-4),D379)","v":"Tasche"},"die Tasche",null,0,"pocket",null,1,{"$f":"RAND()","v":0.9829494611680039},{"$f":"IF(Table24[[#This Row],[Type Here]]=\"\",\"\",IF(Table24[[#This Row],[Type Here]]=Table24[[#This Row],[Answer]],1,-2))","v":""},{"$f":"IF($K$1=1,Table24[[#This Row],[Strength1]],Table24[[#This Row],[Strength2]])","v":1},{"$f":"IF($K$1=1,D379,G379)","v":"pocket"},null,{"$f":"IF($K$1=1,IF(E379=\"\",\"\",E379),IF(H379=\"\",\"\",H379))","v":""},{"$f":"IF($K$1=1,G379,D379)","v":"die Tasche"}]
[null,"33-Adverbs 1",{"$f":"IF(AND(LEFT(D380,1)=\"d\",MID(D380,4,1)=\" \"),RIGHT(D380,LEN(D380)-4),D380)","v":"damit"},"damit",null,0,"with that",null,0,{"$f":"RAND()","v":0.05454722406215484},{"$f":"IF(Table24[[#This Row],[Type Here]]=\"\",\"\",IF(Table24[[#This Row],[Type Here]]=Table24[[#This Row],[Answer]],1,-2))","v":""},{"$f":"IF($K$1=1,Table24[[#This Row],[Strength1]],Table24[[#This Row],[Strength2]])","v":0},{"$f":"IF($K$1=1,D380,G380)","v":"with that"},null,{"$f":"IF($K$1=1,IF(E380=\"\",\"\",E380),IF(H380=\"\",\"\",H380))","v":""},{"$f":"IF($K$1=1,G380,D380)","v":"damit"}]
[null,"33-Adverbs 1",{"$f":"IF(AND(LEFT(D381,1)=\"d\",MID(D381,4,1)=\" \"),RIGHT(D381,LEN(D381)-4),D381)","v":"somit"},"somit",null,0,"therefore","consequently",0,{"$f":"RAND()","v":0.3175044900319316},{"$f":"IF(Table24[[#This Row],[Type Here]]=\"\",\"\",IF(Table24[[#This Row],[Type Here]]=Table24[[#This Row],[Answer]],1,-2))","v":""},{"$f":"IF($K$1=1,Table24[[#This Row],[Strength1]],Table24[[#This Row],[Strength2]])","v":0},{"$f":"IF($K$1=1,D381,G381)","v":"therefore"},null,{"$f":"IF($K$1=1,IF(E381=\"\",\"\",E381),IF(H381=\"\",\"\",H381))","v":"consequently"},{"$f":"IF($K$1=1,G381,D381)","v":"somit"}]
[null,"05-Animals",{"$f":"IF(AND(LEFT(D382,1)=\"d\",MID(D382,4,1)=\" \"),RIGHT(D382,LEN(D382)-4),D382)","v":"Pferde"},"die Pferde",null,0,"horses",null,1,{"$f":"RAND()","v":0.11838642975018576},{"$f":"IF(Table24[[#This Row],[Type Here]]=\"\",\"\",IF(Table24[[#This Row],[Type Here]]=Table24[[#This Row],[Answer]],1,-2))","v":""},{"$f":"IF($K$1=1,Table24[[#This Row],[Strength1]],Table24[[#This Row],[Strength2]])","v":1},{"$f":"IF($K$1=1,D382,G382)","v":"horses"},null,{"$f":"IF($K$1=1,IF(E382=\"\",\"\",E382),IF(H382=\"\",\"\",H382))","v":""},{"$f":"IF($K$1=1,G382,D382)","v":"die Pferde"}]
[null,"09-Clothing",{"$f":"IF(AND(LEFT(D383,1)=\"d\",MID(D383,4,1)=\" \"),RIGHT(D383,LEN(D383)-4),D383)","v":"Schuh"},"der Schuh",null,0,"shoe",null,-2,{"$f":"RAND()","v":0.8932050171530221},{"$f":"IF(Table24[[#This Row],[Type Here]]=\"\",\"\",IF(Table24[[#This Row],[Type Here]]=Table24[[#This Row],[Answer]],1,-2))","v":""},{"$f":"IF($K$1=1,Table24[[#This Row],[Strength1]],Table24[[#This Row],[Strength2]])","v":-2},{"$f":"IF($K$1=1,D383,G383)","v":"shoe"},null,{"$f":"IF($K$1=1,IF(E383=\"\",\"\",E383),IF(H383=\"\",\"\",H383))","v":""},{"$f":"IF($K$1=1,G383,D383)","v":"der Schuh"}]
[null,"01-Basics 1",{"$f":"IF(AND(LEFT(D384,1)=\"d\",MID(D384,4,1)=\" \"),RIGHT(D384,LEN(D384)-4),D384)","v":"Mann"},"der Mann","(spouse)",0,"husband",null,0,{"$f":"RAND()","v":0.17821751409322217},{"$f":"IF(Table24[[#This Row],[Type Here]]=\"\",\"\",IF(Table24[[#This Row],[Type Here]]=Table24[[#This Row],[Answer]],1,-2))","v":""},{"$f":"IF($K$1=1,Table24[[#This Row],[Strength1]],Table24[[#This Row],[Strength2]])","v":0},{"$f":"IF($K$1=1,D384,G384)","v":"husband"},null,{"$f":"IF($K$1=1,IF(E384=\"\",\"\",E384),IF(H384=\"\",\"\",H384))","v":""},{"$f":"IF($K$1=1,G384,D384)","v":"der Mann"}]
[null,"39-Adj: Acc.",{"$f":"IF(AND(LEFT(D385,1)=\"d\",MID(D385,4,1)=\" \"),RIGHT(D385,LEN(D385)-4),D385)","v":"zuständig"},"zuständig",null,0,"responsible","(responsible for)",9,{"$f":"RAND()","v":0.9014846240336543},{"$f":"IF(Table24[[#This Row],[Type Here]]=\"\",\"\",IF(Table24[[#This Row],[Type Here]]=Table24[[#This Row],[Answer]],1,-2))","v":""},{"$f":"IF($K$1=1,Table24[[#This Row],[Strength1]],Table24[[#This Row],[Strength2]])","v":9},{"$f":"IF($K$1=1,D385,G385)","v":"responsible"},null,{"$f":"IF($K$1=1,IF(E385=\"\",\"\",E385),IF(H385=\"\",\"\",H385))","v":"(responsible for)"},{"$f":"IF($K$1=1,G385,D385)","v":"zuständig"}]
[null,"40-Places",{"$f":"IF(AND(LEFT(D386,1)=\"d\",MID(D386,4,1)=\" \"),RIGHT(D386,LEN(D386)-4),D386)","v":"Süden"},"der Süden",null,0,"south",null,0,{"$f":"RAND()","v":0.6180298875105699},{"$f":"IF(Table24[[#This Row],[Type Here]]=\"\",\"\",IF(Table24[[#This Row],[Type Here]]=Table24[[#This Row],[Answer]],1,-2))","v":""},{"$f":"IF($K$1=1,Table24[[#This Row],[Strength1]],Table24[[#This Row],[Strength2]])","v":0},{"$f":"IF($K$1=1,D386,G386)","v":"south"},null,{"$f":"IF($K$1=1,IF(E386=\"\",\"\",E386),IF(H386=\"\",\"\",H386))","v":""},{"$f":"IF($K$1=1,G386,D386)","v":"der Süden"}]
[null,"33-Adverbs 1",{"$f":"IF(AND(LEFT(D387,1)=\"d\",MID(D387,4,1)=\" \"),RIGHT(D387,LEN(D387)-4),D387)","v":"selbst"},"selbst",null,0,"self","written, more formal",1,{"$f":"RAND()","v":0.2578424526720212},{"$f":"IF(Table24[[#This Row],[Type Here]]=\"\",\"\",IF(Table24[[#This Row],[Type Here]]=Table24[[#This Row],[Answer]],1,-2))","v":""},{"$f":"IF($K$1=1,Table24[[#This Row],[Strength1]],Table24[[#This Row],[Strength2]])","v":1},{"$f":"IF($K$1=1,D387,G387)","v":"self"},null,{"$f":"IF($K$1=1,IF(E387=\"\",\"\",E387),IF(H387=\"\",\"\",H387))","v":"written, more formal"},{"$f":"IF($K$1=1,G387,D387)","v":"selbst"}]
[null,"08-V. Pres. 1",{"$f":"IF(AND(LEFT(D388,1)=\"d\",MID(D388,4,1)=\" \"),RIGHT(D388,LEN(D388)-4),D388)","v":"spielen"},"spielen",null,0,"to play",null,0,{"$f":"RAND()","v":0.2838368637645574},{"$f":"IF(Table24[[#This Row],[Type Here]]=\"\",\"\",IF(Table24[[#This Row],[Type Here]]=Table24[[#This Row],[Answer]],1,-2))","v":""},{"$f":"IF($K$1=1,Table24[[#This Row],[Strength1]],Table24[[#This Row],[Strength2]])","v":0},{"$f":"IF($K$1=1,D388,G388)","v":"to play"},null,{"$f":"IF($K$1=1,IF(E388=\"\",\"\",E388),IF(H388=\"\",\"\",H388))","v":""},{"$f":"IF($K$1=1,G388,D388)","v":"spielen"}]
[null,"02-Basics 2",{"$f":"IF(AND(LEFT(D389,1)=\"d\",MID(D389,4,1)=\" \"),RIGHT(D389,LEN(D389)-4),D389)","v":"ihr"},"ihr",null,0,"you","Nom informal plural",-1,{"$f":"RAND()","v":0.442060114815531},{"$f":"IF(Table24[[#This Row],[Type Here]]=\"\",\"\",IF(Table24[[#This Row],[Type Here]]=Table24[[#This Row],[Answer]],1,-2))","v":""},{"$f":"IF($K$1=1,Table24[[#This Row],[Strength1]],Table24[[#This Row],[Strength2]])","v":-1},{"$f":"IF($K$1=1,D389,G389)","v":"you"},null,{"$f":"IF($K$1=1,IF(E389=\"\",\"\",E389),IF(H389=\"\",\"\",H389))","v":"Nom informal plural"},{"$f":"IF($K$1=1,G389,D389)","v":"ihr"}]
[null,"14-Household",{"$f":"IF(AND(LEFT(D390,1)=\"d\",MID(D390,4,1)=\" \"),RIGHT(D390,LEN(D390)-4),D390)","v":"Spiegel"},"der Spiegel",null,0,"mirror",null,3,{"$f":"RAND()","v":0.5195355705267989},{"$f":"IF(Table24[[#This Row],[Type Here]]=\"\",\"\",IF(Table24[[#This Row],[Type Here]]=Table24[[#This Row],[Answer]],1,-2))","v":""},{"$f":"IF($K$1=1,Table24[[#This Row],[Strength1]],Table24[[#This Row],[Strength2]])","v":3},{"$f":"IF($K$1=1,D390,G390)","v":"mirror"},null,{"$f":"IF($K$1=1,IF(E390=\"\",\"\",E390),IF(H390=\"\",\"\",H390))","v":""},{"$f":"IF($K$1=1,G390,D390)","v":"der Spiegel"}]
[null,"40-Places",{"$f":"IF(AND(LEFT(D391,1)=\"d\",MID(D391,4,1)=\" \"),RIGHT(D391,LEN(D391)-4),D391)","v":"Regionen"},"die Regionen",null,0,"regions","areas, zones",0,{"$f":"RAND()","v":0.45661845332020423},{"$f":"IF(Table24[[#This Row],[Type Here]]=\"\",\"\",IF(Table24[[#This Row],[Type Here]]=Table24[[#This Row],[Answer]],1,-2))","v":""},{"$f":"IF($K$1=1,Table24[[#This Row],[Strength1]],Table24[[#This Row],[Strength2]])","v":0},{"$f":"IF($K$1=1,D391,G391)","v":"regions"},null,{"$f":"IF($K$1=1,IF(E391=\"\",\"\",E391),IF(H391=\"\",\"\",H391))","v":"areas, zones"},{"$f":"IF($K$1=1,G391,D391)","v":"die Regionen"}]
[null,"10-Nom. Pron.",{"$f":"IF(AND(LEFT(D392,1)=\"d\",MID(D392,4,1)=\" \"),RIGHT(D392,LEN(D392)-4),D392)","v":"dies und das"},"dies und das",null,0,"this and that",null,1,{"$f":"RAND()","v":0.5044830006349944},{"$f":"IF(Table24[[#This Row],[Type Here]]=\"\",\"\",IF(Table24[[#This Row],[Type Here]]=Table24[[#This Row],[Answer]],1,-2))","v":""},{"$f":"IF($K$1=1,Table24[[#This Row],[Strength1]],Table24[[#This Row],[Strength2]])","v":1},{"$f":"IF($K$1=1,D392,G392)","v":"this and that"},null,{"$f":"IF($K$1=1,IF(E392=\"\",\"\",E392),IF(H392=\"\",\"\",H392))","v":""},{"$f":"IF($K$1=1,G392,D392)","v":"dies und das"}]
[null,"04-Food",{"$f":"IF(AND(LEFT(D393,1)=\"d\",MID(D393,4,1)=\" \"),RIGHT(D393,LEN(D393)-4),D393)","v":"Orangensaft"},"der Orangensaft",null,0,"orange juice",null,4,{"$f":"RAND()","v":0.6853676194688363},{"$f":"IF(Table24[[#This Row],[Type Here]]=\"\",\"\",IF(Table24[[#This Row],[Type Here]]=Table24[[#This Row],[Answer]],1,-2))","v":""},{"$f":"IF($K$1=1,Table24[[#This Row],[Strength1]],Table24[[#This Row],[Strength2]])","v":4},{"$f":"IF($K$1=1,D393,G393)","v":"orange juice"},null,{"$f":"IF($K$1=1,IF(E393=\"\",\"\",E393),IF(H393=\"\",\"\",H393))","v":""},{"$f":"IF($K$1=1,G393,D393)","v":"der Orangensaft"}]
[null,"02-Basics 2",{"$f":"IF(AND(LEFT(D394,1)=\"d\",MID(D394,4,1)=\" \"),RIGHT(D394,LEN(D394)-4),D394)","v":"es"},"es",null,0,"it",null,0,{"$f":"RAND()","v":0.6502265361215491},{"$f":"IF(Table24[[#This Row],[Type Here]]=\"\",\"\",IF(Table24[[#This Row],[Type Here]]=Table24[[#This Row],[Answer]],1,-2))","v":""},{"$f":"IF($K$1=1,Table24[[#This Row],[Strength1]],Table24[[#This Row],[Strength2]])","v":0},{"$f":"IF($K$1=1,D394,G394)","v":"it"},null,{"$f":"IF($K$1=1,IF(E394=\"\",\"\",E394),IF(H394=\"\",\"\",H394))","v":""},{"$f":"IF($K$1=1,G394,D394)","v":"es"}]
[null,"40-Places",{"$f":"IF(AND(LEFT(D395,1)=\"d\",MID(D395,4,1)=\" \"),RIGHT(D395,LEN(D395)-4),D395)","v":"Zentrale"},"die Zentrale",null,0,"main office","headquarters",5,{"$f":"RAND()","v":0.30694293906664416},{"$f":"IF(Table24[[#This Row],[Type Here]]=\"\",\"\",IF(Table24[[#This Row],[Type Here]]=Table24[[#This Row],[Answer]],1,-2))","v":""},{"$f":"IF($K$1=1,Table24[[#This Row],[Strength1]],Table24[[#This Row],[Strength2]])","v":5},{"$f":"IF($K$1=1,D395,G395)","v":"main office"},null,{"$f":"IF($K$1=1,IF(E395=\"\",\"\",E395),IF(H395=\"\",\"\",H395))","v":"headquarters"},{"$f":"IF($K$1=1,G395,D395)","v":"die Zentrale"}]
[null,"01-Basics 1",{"$f":"IF(AND(LEFT(D396,1)=\"d\",MID(D396,4,1)=\" \"),RIGHT(D396,LEN(D396)-4),D396)","v":"sie trinkt"},"sie trinkt",null,0,"she drinks",null,0,{"$f":"RAND()","v":0.5982427919966607},{"$f":"IF(Table24[[#This Row],[Type Here]]=\"\",\"\",IF(Table24[[#This Row],[Type Here]]=Table24[[#This Row],[Answer]],1,-2))","v":""},{"$f":"IF($K$1=1,Table24[[#This Row],[Strength1]],Table24[[#This Row],[Strength2]])","v":0},{"$f":"IF($K$1=1,D396,G396)","v":"she drinks"},null,{"$f":"IF($K$1=1,IF(E396=\"\",\"\",E396),IF(H396=\"\",\"\",H396))","v":""},{"$f":"IF($K$1=1,G396,D396)","v":"sie trinkt"}]
[null,"07-Adjectives",{"$f":"IF(AND(LEFT(D397,1)=\"d\",MID(D397,4,1)=\" \"),RIGHT(D397,LEN(D397)-4),D397)","v":"schnell"},"schnell",null,0,"fast",null,0,{"$f":"RAND()","v":0.4909575725176254},{"$f":"IF(Table24[[#This Row],[Type Here]]=\"\",\"\",IF(Table24[[#This Row],[Type Here]]=Table24[[#This Row],[Answer]],1,-2))","v":""},{"$f":"IF($K$1=1,Table24[[#This Row],[Strength1]],Table24[[#This Row],[Strength2]])","v":0},{"$f":"IF($K$1=1,D397,G397)","v":"fast"},null,{"$f":"IF($K$1=1,IF(E397=\"\",\"\",E397),IF(H397=\"\",\"\",H397))","v":""},{"$f":"IF($K$1=1,G397,D397)","v":"schnell"}]
[null,"36-Nature",{"$f":"IF(AND(LEFT(D398,1)=\"d\",MID(D398,4,1)=\" \"),RIGHT(D398,LEN(D398)-4),D398)","v":"Erden"},"die Erden",null,0,"earths",null,6,{"$f":"RAND()","v":0.47918659670763786},{"$f":"IF(Table24[[#This Row],[Type Here]]=\"\",\"\",IF(Table24[[#This Row],[Type Here]]=Table24[[#This Row],[Answer]],1,-2))","v":""},{"$f":"IF($K$1=1,Table24[[#This Row],[Strength1]],Table24[[#This Row],[Strength2]])","v":6},{"$f":"IF($K$1=1,D398,G398)","v":"earths"},null,{"$f":"IF($K$1=1,IF(E398=\"\",\"\",E398),IF(H398=\"\",\"\",H398))","v":""},{"$f":"IF($K$1=1,G398,D398)","v":"die Erden"}]
[null,"07-Adjectives",{"$f":"IF(AND(LEFT(D399,1)=\"d\",MID(D399,4,1)=\" \"),RIGHT(D399,LEN(D399)-4),D399)","v":"rund"},"rund",null,0,"round",null,0,{"$f":"RAND()","v":0.4122092521124139},{"$f":"IF(Table24[[#This Row],[Type Here]]=\"\",\"\",IF(Table24[[#This Row],[Type Here]]=Table24[[#This Row],[Answer]],1,-2))","v":""},{"$f":"IF($K$1=1,Table24[[#This Row],[Strength1]],Table24[[#This Row],[Strength2]])","v":0},{"$f":"IF($K$1=1,D399,G399)","v":"round"},null,{"$f":"IF($K$1=1,IF(E399=\"\",\"\",E399),IF(H399=\"\",\"\",H399))","v":""},{"$f":"IF($K$1=1,G399,D399)","v":"rund"}]
[null,"07-Adjectives",{"$f":"IF(AND(LEFT(D400,1)=\"d\",MID(D400,4,1)=\" \"),RIGHT(D400,LEN(D400)-4),D400)","v":"toll"},"toll",null,0,"treat",null,0,{"$f":"RAND()","v":0.5890810514684941},{"$f":"IF(Table24[[#This Row],[Type Here]]=\"\",\"\",IF(Table24[[#This Row],[Type Here]]=Table24[[#This Row],[Answer]],1,-2))","v":""},{"$f":"IF($K$1=1,Table24[[#This Row],[Strength1]],Table24[[#This Row],[Strength2]])","v":0},{"$f":"IF($K$1=1,D400,G400)","v":"treat"},null,{"$f":"IF($K$1=1,IF(E400=\"\",\"\",E400),IF(H400=\"\",\"\",H400))","v":""},{"$f":"IF($K$1=1,G400,D400)","v":"toll"}]
[null,"38-Ad: Nom. 1",{"$f":"IF(AND(LEFT(D401,1)=\"d\",MID(D401,4,1)=\" \"),RIGHT(D401,LEN(D401)-4),D401)","v":"größt"},"größt",null,0,"greatest","(most)",3,{"$f":"RAND()","v":0.47981457031360675},{"$f":"IF(Table24[[#This Row],[Type Here]]=\"\",\"\",IF(Table24[[#This Row],[Type Here]]=Table24[[#This Row],[Answer]],1,-2))","v":""},{"$f":"IF($K$1=1,Table24[[#This Row],[Strength1]],Table24[[#This Row],[Strength2]])","v":3},{"$f":"IF($K$1=1,D401,G401)","v":"greatest"},null,{"$f":"IF($K$1=1,IF(E401=\"\",\"\",E401),IF(H401=\"\",\"\",H401))","v":"(most)"},{"$f":"IF($K$1=1,G401,D401)","v":"größt"}]
[null,"04-Food",{"$f":"IF(AND(LEFT(D402,1)=\"d\",MID(D402,4,1)=\" \"),RIGHT(D402,LEN(D402)-4),D402)","v":"Abendessen"},"das Abendessen",null,0,"supper",null,4,{"$f":"RAND()","v":0.4647549987785674},{"$f":"IF(Table24[[#This Row],[Type Here]]=\"\",\"\",IF(Table24[[#This Row],[Type Here]]=Table24[[#This Row],[Answer]],1,-2))","v":""},{"$f":"IF($K$1=1,Table24[[#This Row],[Strength1]],Table24[[#This Row],[Strength2]])","v":4},{"$f":"IF($K$1=1,D402,G402)","v":"supper"},null,{"$f":"IF($K$1=1,IF(E402=\"\",\"\",E402),IF(H402=\"\",\"\",H402))","v":""},{"$f":"IF($K$1=1,G402,D402)","v":"das Abendessen"}]
[null,"14-Household",{"$f":"IF(AND(LEFT(D403,1)=\"d\",MID(D403,4,1)=\" \"),RIGHT(D403,LEN(D403)-4),D403)","v":"Tore"},"die Tore",null,0,"gates","(goals)",0,{"$f":"RAND()","v":0.9935329114678588},{"$f":"IF(Table24[[#This Row],[Type Here]]=\"\",\"\",IF(Table24[[#This Row],[Type Here]]=Table24[[#This Row],[Answer]],1,-2))","v":""},{"$f":"IF($K$1=1,Table24[[#This Row],[Strength1]],Table24[[#This Row],[Strength2]])","v":0},{"$f":"IF($K$1=1,D403,G403)","v":"gates"},null,{"$f":"IF($K$1=1,IF(E403=\"\",\"\",E403),IF(H403=\"\",\"\",H403))","v":"(goals)"},{"$f":"IF($K$1=1,G403,D403)","v":"die Tore"}]
[null,"01-Basics 1",{"$f":"IF(AND(LEFT(D404,1)=\"d\",MID(D404,4,1)=\" \"),RIGHT(D404,LEN(D404)-4),D404)","v":"Mann"},"der Mann","(gender)",0,"man",null,1,{"$f":"RAND()","v":0.12057465526070554},{"$f":"IF(Table24[[#This Row],[Type Here]]=\"\",\"\",IF(Table24[[#This Row],[Type Here]]=Table24[[#This Row],[Answer]],1,-2))","v":""},{"$f":"IF($K$1=1,Table24[[#This Row],[Strength1]],Table24[[#This Row],[Strength2]])","v":1},{"$f":"IF($K$1=1,D404,G404)","v":"man"},null,{"$f":"IF($K$1=1,IF(E404=\"\",\"\",E404),IF(H404=\"\",\"\",H404))","v":""},{"$f":"IF($K$1=1,G404,D404)","v":"der Mann"}]
[null,"36-Nature",{"$f":"IF(AND(LEFT(D405,1)=\"d\",MID(D405,4,1)=\" \"),RIGHT(D405,LEN(D405)-4),D405)","v":"See"},"der See",null,0,"lake",null,6,{"$f":"RAND()","v":0.03703705879770458},{"$f":"IF(Table24[[#This Row],[Type Here]]=\"\",\"\",IF(Table24[[#This Row],[Type Here]]=Table24[[#This Row],[Answer]],1,-2))","v":""},{"$f":"IF($K$1=1,Table24[[#This Row],[Strength1]],Table24[[#This Row],[Strength2]])","v":6},{"$f":"IF($K$1=1,D405,G405)","v":"lake"},null,{"$f":"IF($K$1=1,IF(E405=\"\",\"\",E405),IF(H405=\"\",\"\",H405))","v":""},{"$f":"IF($K$1=1,G405,D405)","v":"der See"}]
[null,"29-Medical",{"$f":"IF(AND(LEFT(D406,1)=\"d\",MID(D406,4,1)=\" \"),RIGHT(D406,LEN(D406)-4),D406)","v":"Medizin"},"die Medizin",null,0,"medicine",null,3,{"$f":"RAND()","v":0.3492211607871817},{"$f":"IF(Table24[[#This Row],[Type Here]]=\"\",\"\",IF(Table24[[#This Row],[Type Here]]=Table24[[#This Row],[Answer]],1,-2))","v":""},{"$f":"IF($K$1=1,Table24[[#This Row],[Strength1]],Table24[[#This Row],[Strength2]])","v":3},{"$f":"IF($K$1=1,D406,G406)","v":"medicine"},null,{"$f":"IF($K$1=1,IF(E406=\"\",\"\",E406),IF(H406=\"\",\"\",H406))","v":""},{"$f":"IF($K$1=1,G406,D406)","v":"die Medizin"}]
[null,"11-Family",{"$f":"IF(AND(LEFT(D407,1)=\"d\",MID(D407,4,1)=\" \"),RIGHT(D407,LEN(D407)-4),D407)","v":"Großväter"},"die Großväter",null,null,"grandfathers",null,null,{"$f":"RAND()","v":0.6517419599529604},{"$f":"IF(Table24[[#This Row],[Type Here]]=\"\",\"\",IF(Table24[[#This Row],[Type Here]]=Table24[[#This Row],[Answer]],1,-2))","v":""},{"$f":"IF($K$1=1,Table24[[#This Row],[Strength1]],Table24[[#This Row],[Strength2]])","v":0},{"$f":"IF($K$1=1,D407,G407)","v":"grandfathers"},null,{"$f":"IF($K$1=1,IF(E407=\"\",\"\",E407),IF(H407=\"\",\"\",H407))","v":""},{"$f":"IF($K$1=1,G407,D407)","v":"die Großväter"}]
[null,"33-Adverbs 1",{"$f":"IF(AND(LEFT(D408,1)=\"d\",MID(D408,4,1)=\" \"),RIGHT(D408,LEN(D408)-4),D408)","v":"heute"},"heute",null,0,"today",null,2,{"$f":"RAND()","v":0.9070718187506127},{"$f":"IF(Table24[[#This Row],[Type Here]]=\"\",\"\",IF(Table24[[#This Row],[Type Here]]=Table24[[#This Row],[Answer]],1,-2))","v":""},{"$f":"IF($K$1=1,Table24[[#This Row],[Strength1]],Table24[[#This Row],[Strength2]])","v":2},{"$f":"IF($K$1=1,D408,G408)","v":"today"},null,{"$f":"IF($K$1=1,IF(E408=\"\",\"\",E408),IF(H408=\"\",\"\",H408))","v":""},{"$f":"IF($K$1=1,G408,D408)","v":"heute"}]
[null,"36-Nature",{"$f":"IF(AND(LEFT(D409,1)=\"d\",MID(D409,4,1)=\" \"),RIGHT(D409,LEN(D409)-4),D409)","v":"Meere"},"die Meere",null,0,"seas",null,6,{"$f":"RAND()","v":0.6695040263678925},{"$f":"IF(Table24[[#This Row],[Type Here]]=\"\",\"\",IF(Table24[[#This Row],[Type Here]]=Table24[[#This Row],[Answer]],1,-2))","v":""},{"$f":"IF($K$1=1,Table24[[#This Row],[Strength1]],Table24[[#This Row],[Strength2]])","v":6},{"$f":"IF($K$1=1,D409,G409)","v":"seas"},null,{"$f":"IF($K$1=1,IF(E409=\"\",\"\",E409),IF(H409=\"\",\"\",H409))","v":""},{"$f":"IF($K$1=1,G409,D409)","v":"die Meere"}]
[null,"36-Nature",{"$f":"IF(AND(LEFT(D410,1)=\"d\",MID(D410,4,1)=\" \"),RIGHT(D410,LEN(D410)-4),D410)","v":"Himmel"},"der Himmel","(above the earth)",0,"sky",null,6,{"$f":"RAND()","v":0.5519805517448404},{"$f":"IF(Table24[[#This Row],[Type Here]]=\"\",\"\",IF(Table24[[#This Row],[Type Here]]=Table24[[#This Row],[Answer]],1,-2))","v":""},{"$f":"IF($K$1=1,Table24[[#This Row],[Strength1]],Table24[[#This Row],[Strength2]])","v":6},{"$f":"IF($K$1=1,D410,G410)","v":"sky"},null,{"$f":"IF($K$1=1,IF(E410=\"\",\"\",E410),IF(H410=\"\",\"\",H410))","v":""},{"$f":"IF($K$1=1,G410,D410)","v":"der Himmel"}]
[null,"22-Colors",{"$f":"IF(AND(LEFT(D411,1)=\"d\",MID(D411,4,1)=\" \"),RIGHT(D411,LEN(D411)-4),D411)","v":"schwarz"},"schwarz",null,0,"black",null,1,{"$f":"RAND()","v":0.06950005752367105},{"$f":"IF(Table24[[#This Row],[Type Here]]=\"\",\"\",IF(Table24[[#This Row],[Type Here]]=Table24[[#This Row],[Answer]],1,-2))","v":""},{"$f":"IF($K$1=1,Table24[[#This Row],[Strength1]],Table24[[#This Row],[Strength2]])","v":1},{"$f":"IF($K$1=1,D411,G411)","v":"black"},null,{"$f":"IF($K$1=1,IF(E411=\"\",\"\",E411),IF(H411=\"\",\"\",H411))","v":""},{"$f":"IF($K$1=1,G411,D411)","v":"schwarz"}]
[null,"06-Plurals",{"$f":"IF(AND(LEFT(D412,1)=\"d\",MID(D412,4,1)=\" \"),RIGHT(D412,LEN(D412)-4),D412)","v":"Hunde"},"die Hunde",null,0,"dogs","noun",2,{"$f":"RAND()","v":0.671276358900804},{"$f":"IF(Table24[[#This Row],[Type Here]]=\"\",\"\",IF(Table24[[#This Row],[Type Here]]=Table24[[#This Row],[Answer]],1,-2))","v":""},{"$f":"IF($K$1=1,Table24[[#This Row],[Strength1]],Table24[[#This Row],[Strength2]])","v":2},{"$f":"IF($K$1=1,D412,G412)","v":"dogs"},null,{"$f":"IF($K$1=1,IF(E412=\"\",\"\",E412),IF(H412=\"\",\"\",H412))","v":"noun"},{"$f":"IF($K$1=1,G412,D412)","v":"die Hunde"}]
[null,"36-Nature",{"$f":"IF(AND(LEFT(D413,1)=\"d\",MID(D413,4,1)=\" \"),RIGHT(D413,LEN(D413)-4),D413)","v":"Gras"},"das Gras",null,0,"grass",null,6,{"$f":"RAND()","v":0.3532961819604217},{"$f":"IF(Table24[[#This Row],[Type Here]]=\"\",\"\",IF(Table24[[#This Row],[Type Here]]=Table24[[#This Row],[Answer]],1,-2))","v":""},{"$f":"IF($K$1=1,Table24[[#This Row],[Strength1]],Table24[[#This Row],[Strength2]])","v":6},{"$f":"IF($K$1=1,D413,G413)","v":"grass"},null,{"$f":"IF($K$1=1,IF(E413=\"\",\"\",E413),IF(H413=\"\",\"\",H413))","v":""},{"$f":"IF($K$1=1,G413,D413)","v":"das Gras"}]
[null,"07-Adjectives",{"$f":"IF(AND(LEFT(D414,1)=\"d\",MID(D414,4,1)=\" \"),RIGHT(D414,LEN(D414)-4),D414)","v":"alt"},"alt",null,0,"old",null,3,{"$f":"RAND()","v":0.522089168520435},{"$f":"IF(Table24[[#This Row],[Type Here]]=\"\",\"\",IF(Table24[[#This Row],[Type Here]]=Table24[[#This Row],[Answer]],1,-2))","v":""},{"$f":"IF($K$1=1,Table24[[#This Row],[Strength1]],Table24[[#This Row],[Strength2]])","v":3},{"$f":"IF($K$1=1,D414,G414)","v":"old"},null,{"$f":"IF($K$1=1,IF(E414=\"\",\"\",E414),IF(H414=\"\",\"\",H414))","v":""},{"$f":"IF($K$1=1,G414,D414)","v":"alt"}]
[null,"04-Food",{"$f":"IF(AND(LEFT(D415,1)=\"d\",MID(D415,4,1)=\" \"),RIGHT(D415,LEN(D415)-4),D415)","v":"Saft"},"der Saft",null,0,"juice",null,3,{"$f":"RAND()","v":0.14356330083449997},{"$f":"IF(Table24[[#This Row],[Type Here]]=\"\",\"\",IF(Table24[[#This Row],[Type Here]]=Table24[[#This Row],[Answer]],1,-2))","v":""},{"$f":"IF($K$1=1,Table24[[#This Row],[Strength1]],Table24[[#This Row],[Strength2]])","v":3},{"$f":"IF($K$1=1,D415,G415)","v":"juice"},null,{"$f":"IF($K$1=1,IF(E415=\"\",\"\",E415),IF(H415=\"\",\"\",H415))","v":""},{"$f":"IF($K$1=1,G415,D415)","v":"der Saft"}]
[null,"14-Household",{"$f":"IF(AND(LEFT(D416,1)=\"d\",MID(D416,4,1)=\" \"),RIGHT(D416,LEN(D416)-4),D416)","v":"Zahnbürsten"},"die Zahnbürsten",null,0,"tooth brushes",null,-2,{"$f":"RAND()","v":0.04644960261387732},{"$f":"IF(Table24[[#This Row],[Type Here]]=\"\",\"\",IF(Table24[[#This Row],[Type Here]]=Table24[[#This Row],[Answer]],1,-2))","v":""},{"$f":"IF($K$1=1,Table24[[#This Row],[Strength1]],Table24[[#This Row],[Strength2]])","v":-2},{"$f":"IF($K$1=1,D416,G416)","v":"tooth brushes"},null,{"$f":"IF($K$1=1,IF(E416=\"\",\"\",E416),IF(H416=\"\",\"\",H416))","v":""},{"$f":"IF($K$1=1,G416,D416)","v":"die Zahnbürsten"}]
[null,"38-Ad: Nom. 1",{"$f":"IF(AND(LEFT(D417,1)=\"d\",MID(D417,4,1)=\" \"),RIGHT(D417,LEN(D417)-4),D417)","v":"eigen"},"eigen",null,0,"own","adjective (ex: his own car)",3,{"$f":"RAND()","v":0.5103737048105373},{"$f":"IF(Table24[[#This Row],[Type Here]]=\"\",\"\",IF(Table24[[#This Row],[Type Here]]=Table24[[#This Row],[Answer]],1,-2))","v":""},{"$f":"IF($K$1=1,Table24[[#This Row],[Strength1]],Table24[[#This Row],[Strength2]])","v":3},{"$f":"IF($K$1=1,D417,G417)","v":"own"},null,{"$f":"IF($K$1=1,IF(E417=\"\",\"\",E417),IF(H417=\"\",\"\",H417))","v":"adjective (ex: his own car)"},{"$f":"IF($K$1=1,G417,D417)","v":"eigen"}]
[null,"10-Nom. Pron.",{"$f":"IF(AND(LEFT(D418,1)=\"d\",MID(D418,4,1)=\" \"),RIGHT(D418,LEN(D418)-4),D418)","v":"beide"},"beide",null,0,"both","the two of them",1,{"$f":"RAND()","v":0.3525732788219873},{"$f":"IF(Table24[[#This Row],[Type Here]]=\"\",\"\",IF(Table24[[#This Row],[Type Here]]=Table24[[#This Row],[Answer]],1,-2))","v":""},{"$f":"IF($K$1=1,Table24[[#This Row],[Strength1]],Table24[[#This Row],[Strength2]])","v":1},{"$f":"IF($K$1=1,D418,G418)","v":"both"},null,{"$f":"IF($K$1=1,IF(E418=\"\",\"\",E418),IF(H418=\"\",\"\",H418))","v":"the two of them"},{"$f":"IF($K$1=1,G418,D418)","v":"beide"}]
[null,"04-Food",{"$f":"IF(AND(LEFT(D419,1)=\"d\",MID(D419,4,1)=\" \"),RIGHT(D419,LEN(D419)-4),D419)","v":"wir haben Durst"},"wir haben Durst",null,0,"we are thirsty",null,1,{"$f":"RAND()","v":0.2042975688914006},{"$f":"IF(Table24[[#This Row],[Type Here]]=\"\",\"\",IF(Table24[[#This Row],[Type Here]]=Table24[[#This Row],[Answer]],1,-2))","v":""},{"$f":"IF($K$1=1,Table24[[#This Row],[Strength1]],Table24[[#This Row],[Strength2]])","v":1},{"$f":"IF($K$1=1,D419,G419)","v":"we are thirsty"},null,{"$f":"IF($K$1=1,IF(E419=\"\",\"\",E419),IF(H419=\"\",\"\",H419))","v":""},{"$f":"IF($K$1=1,G419,D419)","v":"wir haben Durst"}]
[null,"14-Household",{"$f":"IF(AND(LEFT(D420,1)=\"d\",MID(D420,4,1)=\" \"),RIGHT(D420,LEN(D420)-4),D420)","v":"Sofa"},"das Sofa",null,0,"sofa",null,1,{"$f":"RAND()","v":0.7962025718353009},{"$f":"IF(Table24[[#This Row],[Type Here]]=\"\",\"\",IF(Table24[[#This Row],[Type Here]]=Table24[[#This Row],[Answer]],1,-2))","v":""},{"$f":"IF($K$1=1,Table24[[#This Row],[Strength1]],Table24[[#This Row],[Strength2]])","v":1},{"$f":"IF($K$1=1,D420,G420)","v":"sofa"},null,{"$f":"IF($K$1=1,IF(E420=\"\",\"\",E420),IF(H420=\"\",\"\",H420))","v":""},{"$f":"IF($K$1=1,G420,D420)","v":"das Sofa"}]
[null,"07-Adjectives",{"$f":"IF(AND(LEFT(D421,1)=\"d\",MID(D421,4,1)=\" \"),RIGHT(D421,LEN(D421)-4),D421)","v":"voll"},"voll",null,0,"full of",null,4,{"$f":"RAND()","v":0.9888334824067313},{"$f":"IF(Table24[[#This Row],[Type Here]]=\"\",\"\",IF(Table24[[#This Row],[Type Here]]=Table24[[#This Row],[Answer]],1,-2))","v":""},{"$f":"IF($K$1=1,Table24[[#This Row],[Strength1]],Table24[[#This Row],[Strength2]])","v":4},{"$f":"IF($K$1=1,D421,G421)","v":"full of"},null,{"$f":"IF($K$1=1,IF(E421=\"\",\"\",E421),IF(H421=\"\",\"\",H421))","v":""},{"$f":"IF($K$1=1,G421,D421)","v":"voll"}]
[null,"04-Food",{"$f":"IF(AND(LEFT(D422,1)=\"d\",MID(D422,4,1)=\" \"),RIGHT(D422,LEN(D422)-4),D422)","v":"Durst"},"der Durst",null,0,"thirst",null,3,{"$f":"RAND()","v":0.19684290624070666},{"$f":"IF(Table24[[#This Row],[Type Here]]=\"\",\"\",IF(Table24[[#This Row],[Type Here]]=Table24[[#This Row],[Answer]],1,-2))","v":""},{"$f":"IF($K$1=1,Table24[[#This Row],[Strength1]],Table24[[#This Row],[Strength2]])","v":3},{"$f":"IF($K$1=1,D422,G422)","v":"thirst"},null,{"$f":"IF($K$1=1,IF(E422=\"\",\"\",E422),IF(H422=\"\",\"\",H422))","v":""},{"$f":"IF($K$1=1,G422,D422)","v":"der Durst"}]
[null,"40-Places",{"$f":"IF(AND(LEFT(D423,1)=\"d\",MID(D423,4,1)=\" \"),RIGHT(D423,LEN(D423)-4),D423)","v":"Westen"},"der Westen",null,0,"west",null,-1,{"$f":"RAND()","v":0.509680452131538},{"$f":"IF(Table24[[#This Row],[Type Here]]=\"\",\"\",IF(Table24[[#This Row],[Type Here]]=Table24[[#This Row],[Answer]],1,-2))","v":""},{"$f":"IF($K$1=1,Table24[[#This Row],[Strength1]],Table24[[#This Row],[Strength2]])","v":-1},{"$f":"IF($K$1=1,D423,G423)","v":"west"},null,{"$f":"IF($K$1=1,IF(E423=\"\",\"\",E423),IF(H423=\"\",\"\",H423))","v":""},{"$f":"IF($K$1=1,G423,D423)","v":"der Westen"}]
[null,"36-Nature",{"$f":"IF(AND(LEFT(D424,1)=\"d\",MID(D424,4,1)=\" \"),RIGHT(D424,LEN(D424)-4),D424)","v":"Rhein"},"der Rhein",null,0,"Rhine",null,6,{"$f":"RAND()","v":0.9297489783973034},{"$f":"IF(Table24[[#This Row],[Type Here]]=\"\",\"\",IF(Table24[[#This Row],[Type Here]]=Table24[[#This Row],[Answer]],1,-2))","v":""},{"$f":"IF($K$1=1,Table24[[#This Row],[Strength1]],Table24[[#This Row],[Strength2]])","v":6},{"$f":"IF($K$1=1,D424,G424)","v":"Rhine"},null,{"$f":"IF($K$1=1,IF(E424=\"\",\"\",E424),IF(H424=\"\",\"\",H424))","v":""},{"$f":"IF($K$1=1,G424,D424)","v":"der Rhein"}]
[null,"08-V. Pres. 1",{"$f":"IF(AND(LEFT(D425,1)=\"d\",MID(D425,4,1)=\" \"),RIGHT(D425,LEN(D425)-4),D425)","v":"schlafen"},"schlafen",null,0,"to sleep",null,0,{"$f":"RAND()","v":0.20837469817871135},{"$f":"IF(Table24[[#This Row],[Type Here]]=\"\",\"\",IF(Table24[[#This Row],[Type Here]]=Table24[[#This Row],[Answer]],1,-2))","v":""},{"$f":"IF($K$1=1,Table24[[#This Row],[Strength1]],Table24[[#This Row],[Strength2]])","v":0},{"$f":"IF($K$1=1,D425,G425)","v":"to sleep"},null,{"$f":"IF($K$1=1,IF(E425=\"\",\"\",E425),IF(H425=\"\",\"\",H425))","v":""},{"$f":"IF($K$1=1,G425,D425)","v":"schlafen"}]
[null,"07-Adjectives",{"$f":"IF(AND(LEFT(D426,1)=\"d\",MID(D426,4,1)=\" \"),RIGHT(D426,LEN(D426)-4),D426)","v":"früh"},"früh",null,0,"early",null,0,{"$f":"RAND()","v":0.755606822681364},{"$f":"IF(Table24[[#This Row],[Type Here]]=\"\",\"\",IF(Table24[[#This Row],[Type Here]]=Table24[[#This Row],[Answer]],1,-2))","v":""},{"$f":"IF($K$1=1,Table24[[#This Row],[Strength1]],Table24[[#This Row],[Strength2]])","v":0},{"$f":"IF($K$1=1,D426,G426)","v":"early"},null,{"$f":"IF($K$1=1,IF(E426=\"\",\"\",E426),IF(H426=\"\",\"\",H426))","v":""},{"$f":"IF($K$1=1,G426,D426)","v":"früh"}]
[null,"36-Nature",{"$f":"IF(AND(LEFT(D427,1)=\"d\",MID(D427,4,1)=\" \"),RIGHT(D427,LEN(D427)-4),D427)","v":"Pflanze"},"die Pflanze",null,0,"plant","(vegetation)",6,{"$f":"RAND()","v":0.5632090582739573},{"$f":"IF(Table24[[#This Row],[Type Here]]=\"\",\"\",IF(Table24[[#This Row],[Type Here]]=Table24[[#This Row],[Answer]],1,-2))","v":""},{"$f":"IF($K$1=1,Table24[[#This Row],[Strength1]],Table24[[#This Row],[Strength2]])","v":6},{"$f":"IF($K$1=1,D427,G427)","v":"plant"},null,{"$f":"IF($K$1=1,IF(E427=\"\",\"\",E427),IF(H427=\"\",\"\",H427))","v":"(vegetation)"},{"$f":"IF($K$1=1,G427,D427)","v":"die Pflanze"}]
[null,"40-Places",{"$f":"IF(AND(LEFT(D428,1)=\"d\",MID(D428,4,1)=\" \"),RIGHT(D428,LEN(D428)-4),D428)","v":"Platz"},"der Platz",null,0,"place","(space, seat, locality)",0,{"$f":"RAND()","v":0.28793929790891115},{"$f":"IF(Table24[[#This Row],[Type Here]]=\"\",\"\",IF(Table24[[#This Row],[Type Here]]=Table24[[#This Row],[Answer]],1,-2))","v":""},{"$f":"IF($K$1=1,Table24[[#This Row],[Strength1]],Table24[[#This Row],[Strength2]])","v":0},{"$f":"IF($K$1=1,D428,G428)","v":"place"},null,{"$f":"IF($K$1=1,IF(E428=\"\",\"\",E428),IF(H428=\"\",\"\",H428))","v":"(space, seat, locality)"},{"$f":"IF($K$1=1,G428,D428)","v":"der Platz"}]
[null,"05-Animals",{"$f":"IF(AND(LEFT(D429,1)=\"d\",MID(D429,4,1)=\" \"),RIGHT(D429,LEN(D429)-4),D429)","v":"Fliege"},"die Fliege",null,0,"fly","(type of insect)",1,{"$f":"RAND()","v":0.6993240300368002},{"$f":"IF(Table24[[#This Row],[Type Here]]=\"\",\"\",IF(Table24[[#This Row],[Type Here]]=Table24[[#This Row],[Answer]],1,-2))","v":""},{"$f":"IF($K$1=1,Table24[[#This Row],[Strength1]],Table24[[#This Row],[Strength2]])","v":1},{"$f":"IF($K$1=1,D429,G429)","v":"fly"},null,{"$f":"IF($K$1=1,IF(E429=\"\",\"\",E429),IF(H429=\"\",\"\",H429))","v":"(type of insect)"},{"$f":"IF($K$1=1,G429,D429)","v":"die Fliege"}]
[null,"07-Adjectives",{"$f":"IF(AND(LEFT(D430,1)=\"d\",MID(D430,4,1)=\" \"),RIGHT(D430,LEN(D430)-4),D430)","v":"schwer"},"schwer",null,0,"difficult",null,0,{"$f":"RAND()","v":0.25990456359716907},{"$f":"IF(Table24[[#This Row],[Type Here]]=\"\",\"\",IF(Table24[[#This Row],[Type Here]]=Table24[[#This Row],[Answer]],1,-2))","v":""},{"$f":"IF($K$1=1,Table24[[#This Row],[Strength1]],Table24[[#This Row],[Strength2]])","v":0},{"$f":"IF($K$1=1,D430,G430)","v":"difficult"},null,{"$f":"IF($K$1=1,IF(E430=\"\",\"\",E430),IF(H430=\"\",\"\",H430))","v":""},{"$f":"IF($K$1=1,G430,D430)","v":"schwer"}]
[null,"09-Clothing",{"$f":"IF(AND(LEFT(D431,1)=\"d\",MID(D431,4,1)=\" \"),RIGHT(D431,LEN(D431)-4),D431)","v":"Mantel"},"der Mantel",null,0,"coat",null,1,{"$f":"RAND()","v":0.016513559915274145},{"$f":"IF(Table24[[#This Row],[Type Here]]=\"\",\"\",IF(Table24[[#This Row],[Type Here]]=Table24[[#This Row],[Answer]],1,-2))","v":""},{"$f":"IF($K$1=1,Table24[[#This Row],[Strength1]],Table24[[#This Row],[Strength2]])","v":1},{"$f":"IF($K$1=1,D431,G431)","v":"coat"},null,{"$f":"IF($K$1=1,IF(E431=\"\",\"\",E431),IF(H431=\"\",\"\",H431))","v":""},{"$f":"IF($K$1=1,G431,D431)","v":"der Mantel"}]
[null,"36-Nature",{"$f":"IF(AND(LEFT(D432,1)=\"d\",MID(D432,4,1)=\" \"),RIGHT(D432,LEN(D432)-4),D432)","v":"Metall"},"das Metall",null,0,"metal",null,6,{"$f":"RAND()","v":0.15982097251974303},{"$f":"IF(Table24[[#This Row],[Type Here]]=\"\",\"\",IF(Table24[[#This Row],[Type Here]]=Table24[[#This Row],[Answer]],1,-2))","v":""},{"$f":"IF($K$1=1,Table24[[#This Row],[Strength1]],Table24[[#This Row],[Strength2]])","v":6},{"$f":"IF($K$1=1,D432,G432)","v":"metal"},null,{"$f":"IF($K$1=1,IF(E432=\"\",\"\",E432),IF(H432=\"\",\"\",H432))","v":""},{"$f":"IF($K$1=1,G432,D432)","v":"das Metall"}]
[null,"04-Food",{"$f":"IF(AND(LEFT(D433,1)=\"d\",MID(D433,4,1)=\" \"),RIGHT(D433,LEN(D433)-4),D433)","v":"Getränk"},"das Getränk",null,0,"drink","noun",-2,{"$f":"RAND()","v":0.7195809231360216},{"$f":"IF(Table24[[#This Row],[Type Here]]=\"\",\"\",IF(Table24[[#This Row],[Type Here]]=Table24[[#This Row],[Answer]],1,-2))","v":""},{"$f":"IF($K$1=1,Table24[[#This Row],[Strength1]],Table24[[#This Row],[Strength2]])","v":-2},{"$f":"IF($K$1=1,D433,G433)","v":"drink"},null,{"$f":"IF($K$1=1,IF(E433=\"\",\"\",E433),IF(H433=\"\",\"\",H433))","v":"noun"},{"$f":"IF($K$1=1,G433,D433)","v":"das Getränk"}]
[null,"29-Medical",{"$f":"IF(AND(LEFT(D434,1)=\"d\",MID(D434,4,1)=\" \"),RIGHT(D434,LEN(D434)-4),D434)","v":"Blut"},"das Blut",null,0,"blood",null,4,{"$f":"RAND()","v":0.8788800349849598},{"$f":"IF(Table24[[#This Row],[Type Here]]=\"\",\"\",IF(Table24[[#This Row],[Type Here]]=Table24[[#This Row],[Answer]],1,-2))","v":""},{"$f":"IF($K$1=1,Table24[[#This Row],[Strength1]],Table24[[#This Row],[Strength2]])","v":4},{"$f":"IF($K$1=1,D434,G434)","v":"blood"},null,{"$f":"IF($K$1=1,IF(E434=\"\",\"\",E434),IF(H434=\"\",\"\",H434))","v":""},{"$f":"IF($K$1=1,G434,D434)","v":"das Blut"}]
[null,"40-Places",{"$f":"IF(AND(LEFT(D435,1)=\"d\",MID(D435,4,1)=\" \"),RIGHT(D435,LEN(D435)-4),D435)","v":"Grundstücke"},"die Grundstücke",null,0,"plots of land",null,0,{"$f":"RAND()","v":0.08002315587404252},{"$f":"IF(Table24[[#This Row],[Type Here]]=\"\",\"\",IF(Table24[[#This Row],[Type Here]]=Table24[[#This Row],[Answer]],1,-2))","v":""},{"$f":"IF($K$1=1,Table24[[#This Row],[Strength1]],Table24[[#This Row],[Strength2]])","v":0},{"$f":"IF($K$1=1,D435,G435)","v":"plots of land"},null,{"$f":"IF($K$1=1,IF(E435=\"\",\"\",E435),IF(H435=\"\",\"\",H435))","v":""},{"$f":"IF($K$1=1,G435,D435)","v":"die Grundstücke"}]
[null,"03-Phrases",{"$f":"IF(AND(LEFT(D436,1)=\"d\",MID(D436,4,1)=\" \"),RIGHT(D436,LEN(D436)-4),D436)","v":"hallo"},"hallo",null,0,"hello",null,0,{"$f":"RAND()","v":0.6096753639740095},{"$f":"IF(Table24[[#This Row],[Type Here]]=\"\",\"\",IF(Table24[[#This Row],[Type Here]]=Table24[[#This Row],[Answer]],1,-2))","v":""},{"$f":"IF($K$1=1,Table24[[#This Row],[Strength1]],Table24[[#This Row],[Strength2]])","v":0},{"$f":"IF($K$1=1,D436,G436)","v":"hello"},null,{"$f":"IF($K$1=1,IF(E436=\"\",\"\",E436),IF(H436=\"\",\"\",H436))","v":""},{"$f":"IF($K$1=1,G436,D436)","v":"hallo"}]
[null,"12-Acc. Pron.",{"$f":"IF(AND(LEFT(D437,1)=\"d\",MID(D437,4,1)=\" \"),RIGHT(D437,LEN(D437)-4),D437)","v":"welch"},"welch",null,null,"which","relative pronoun",null,{"$f":"RAND()","v":0.4985397522867805},{"$f":"IF(Table24[[#This Row],[Type Here]]=\"\",\"\",IF(Table24[[#This Row],[Type Here]]=Table24[[#This Row],[Answer]],1,-2))","v":""},{"$f":"IF($K$1=1,Table24[[#This Row],[Strength1]],Table24[[#This Row],[Strength2]])","v":0},{"$f":"IF($K$1=1,D437,G437)","v":"which"},null,{"$f":"IF($K$1=1,IF(E437=\"\",\"\",E437),IF(H437=\"\",\"\",H437))","v":"relative pronoun"},{"$f":"IF($K$1=1,G437,D437)","v":"welch"}]
[null,"40-Places",{"$f":"IF(AND(LEFT(D438,1)=\"d\",MID(D438,4,1)=\" \"),RIGHT(D438,LEN(D438)-4),D438)","v":"Region"},"die Region",null,0,"region","area, zone",5,{"$f":"RAND()","v":0.34511311750547935},{"$f":"IF(Table24[[#This Row],[Type Here]]=\"\",\"\",IF(Table24[[#This Row],[Type Here]]=Table24[[#This Row],[Answer]],1,-2))","v":""},{"$f":"IF($K$1=1,Table24[[#This Row],[Strength1]],Table24[[#This Row],[Strength2]])","v":5},{"$f":"IF($K$1=1,D438,G438)","v":"region"},null,{"$f":"IF($K$1=1,IF(E438=\"\",\"\",E438),IF(H438=\"\",\"\",H438))","v":"area, zone"},{"$f":"IF($K$1=1,G438,D438)","v":"die Region"}]
[null,"14-Household",{"$f":"IF(AND(LEFT(D439,1)=\"d\",MID(D439,4,1)=\" \"),RIGHT(D439,LEN(D439)-4),D439)","v":"Spielzeug"},"das Spielzeug",null,0,"toy",null,-2,{"$f":"RAND()","v":0.3344425822341225},{"$f":"IF(Table24[[#This Row],[Type Here]]=\"\",\"\",IF(Table24[[#This Row],[Type Here]]=Table24[[#This Row],[Answer]],1,-2))","v":""},{"$f":"IF($K$1=1,Table24[[#This Row],[Strength1]],Table24[[#This Row],[Strength2]])","v":-2},{"$f":"IF($K$1=1,D439,G439)","v":"toy"},null,{"$f":"IF($K$1=1,IF(E439=\"\",\"\",E439),IF(H439=\"\",\"\",H439))","v":""},{"$f":"IF($K$1=1,G439,D439)","v":"das Spielzeug"}]
[null,"29-Medical",{"$f":"IF(AND(LEFT(D440,1)=\"d\",MID(D440,4,1)=\" \"),RIGHT(D440,LEN(D440)-4),D440)","v":"Gesundheit"},"die Gesundheit",null,0,"health",null,1,{"$f":"RAND()","v":0.3075471796163348},{"$f":"IF(Table24[[#This Row],[Type Here]]=\"\",\"\",IF(Table24[[#This Row],[Type Here]]=Table24[[#This Row],[Answer]],1,-2))","v":""},{"$f":"IF($K$1=1,Table24[[#This Row],[Strength1]],Table24[[#This Row],[Strength2]])","v":1},{"$f":"IF($K$1=1,D440,G440)","v":"health"},null,{"$f":"IF($K$1=1,IF(E440=\"\",\"\",E440),IF(H440=\"\",\"\",H440))","v":""},{"$f":"IF($K$1=1,G440,D440)","v":"die Gesundheit"}]
[null,"36-Nature",{"$f":"IF(AND(LEFT(D441,1)=\"d\",MID(D441,4,1)=\" \"),RIGHT(D441,LEN(D441)-4),D441)","v":"Erde"},"die Erde",null,0,"earth",null,6,{"$f":"RAND()","v":0.3389723878551265},{"$f":"IF(Table24[[#This Row],[Type Here]]=\"\",\"\",IF(Table24[[#This Row],[Type Here]]=Table24[[#This Row],[Answer]],1,-2))","v":""},{"$f":"IF($K$1=1,Table24[[#This Row],[Strength1]],Table24[[#This Row],[Strength2]])","v":6},{"$f":"IF($K$1=1,D441,G441)","v":"earth"},null,{"$f":"IF($K$1=1,IF(E441=\"\",\"\",E441),IF(H441=\"\",\"\",H441))","v":""},{"$f":"IF($K$1=1,G441,D441)","v":"die Erde"}]
[null,"07-Adjectives",{"$f":"IF(AND(LEFT(D442,1)=\"d\",MID(D442,4,1)=\" \"),RIGHT(D442,LEN(D442)-4),D442)","v":"schlecht"},"schlecht",null,0,"bad",null,1,{"$f":"RAND()","v":0.4992822442394791},{"$f":"IF(Table24[[#This Row],[Type Here]]=\"\",\"\",IF(Table24[[#This Row],[Type Here]]=Table24[[#This Row],[Answer]],1,-2))","v":""},{"$f":"IF($K$1=1,Table24[[#This Row],[Strength1]],Table24[[#This Row],[Strength2]])","v":1},{"$f":"IF($K$1=1,D442,G442)","v":"bad"},null,{"$f":"IF($K$1=1,IF(E442=\"\",\"\",E442),IF(H442=\"\",\"\",H442))","v":""},{"$f":"IF($K$1=1,G442,D442)","v":"schlecht"}]
[null,"03-Phrases",{"$f":"IF(AND(LEFT(D443,1)=\"d\",MID(D443,4,1)=\" \"),RIGHT(D443,LEN(D443)-4),D443)","v":"Es tut mir leid."},"Es tut mir leid.",null,0,"I'm sorry.",null,0,{"$f":"RAND()","v":0.17610428587940719},{"$f":"IF(Table24[[#This Row],[Type Here]]=\"\",\"\",IF(Table24[[#This Row],[Type Here]]=Table24[[#This Row],[Answer]],1,-2))","v":""},{"$f":"IF($K$1=1,Table24[[#This Row],[Strength1]],Table24[[#This Row],[Strength2]])","v":0},{"$f":"IF($K$1=1,D443,G443)","v":"I'm sorry."},null,{"$f":"IF($K$1=1,IF(E443=\"\",\"\",E443),IF(H443=\"\",\"\",H443))","v":""},{"$f":"IF($K$1=1,G443,D443)","v":"Es tut mir leid."}]
[null,"40-Places",{"$f":"IF(AND(LEFT(D444,1)=\"d\",MID(D444,4,1)=\" \"),RIGHT(D444,LEN(D444)-4),D444)","v":"Zentrum"},"das Zentrum",null,0,"center",null,-2,{"$f":"RAND()","v":0.2909079163010697},{"$f":"IF(Table24[[#This Row],[Type Here]]=\"\",\"\",IF(Table24[[#This Row],[Type Here]]=Table24[[#This Row],[Answer]],1,-2))","v":""},{"$f":"IF($K$1=1,Table24[[#This Row],[Strength1]],Table24[[#This Row],[Strength2]])","v":-2},{"$f":"IF($K$1=1,D444,G444)","v":"center"},null,{"$f":"IF($K$1=1,IF(E444=\"\",\"\",E444),IF(H444=\"\",\"\",H444))","v":""},{"$f":"IF($K$1=1,G444,D444)","v":"das Zentrum"}]
[null,"33-Adverbs 1",{"$f":"IF(AND(LEFT(D445,1)=\"d\",MID(D445,4,1)=\" \"),RIGHT(D445,LEN(D445)-4),D445)","v":"oben"},"oben",null,0,"at the top",null,1,{"$f":"RAND()","v":0.3638046207897475},{"$f":"IF(Table24[[#This Row],[Type Here]]=\"\",\"\",IF(Table24[[#This Row],[Type Here]]=Table24[[#This Row],[Answer]],1,-2))","v":""},{"$f":"IF($K$1=1,Table24[[#This Row],[Strength1]],Table24[[#This Row],[Strength2]])","v":1},{"$f":"IF($K$1=1,D445,G445)","v":"at the top"},null,{"$f":"IF($K$1=1,IF(E445=\"\",\"\",E445),IF(H445=\"\",\"\",H445))","v":""},{"$f":"IF($K$1=1,G445,D445)","v":"oben"}]
[null,"33-Adverbs 1",{"$f":"IF(AND(LEFT(D446,1)=\"d\",MID(D446,4,1)=\" \"),RIGHT(D446,LEN(D446)-4),D446)","v":"sinnvoll"},"sinnvoll",null,0,"sensible",null,0,{"$f":"RAND()","v":0.5714836218154784},{"$f":"IF(Table24[[#This Row],[Type Here]]=\"\",\"\",IF(Table24[[#This Row],[Type Here]]=Table24[[#This Row],[Answer]],1,-2))","v":""},{"$f":"IF($K$1=1,Table24[[#This Row],[Strength1]],Table24[[#This Row],[Strength2]])","v":0},{"$f":"IF($K$1=1,D446,G446)","v":"sensible"},null,{"$f":"IF($K$1=1,IF(E446=\"\",\"\",E446),IF(H446=\"\",\"\",H446))","v":""},{"$f":"IF($K$1=1,G446,D446)","v":"sinnvoll"}]
[null,"38-Ad: Nom. 1",{"$f":"IF(AND(LEFT(D447,1)=\"d\",MID(D447,4,1)=\" \"),RIGHT(D447,LEN(D447)-4),D447)","v":"einzeln"},"einzeln",null,0,"isolated","(individual, solitary)",3,{"$f":"RAND()","v":0.8431414721603084},{"$f":"IF(Table24[[#This Row],[Type Here]]=\"\",\"\",IF(Table24[[#This Row],[Type Here]]=Table24[[#This Row],[Answer]],1,-2))","v":""},{"$f":"IF($K$1=1,Table24[[#This Row],[Strength1]],Table24[[#This Row],[Strength2]])","v":3},{"$f":"IF($K$1=1,D447,G447)","v":"isolated"},null,{"$f":"IF($K$1=1,IF(E447=\"\",\"\",E447),IF(H447=\"\",\"\",H447))","v":"(individual, solitary)"},{"$f":"IF($K$1=1,G447,D447)","v":"einzeln"}]
[null,"05-Animals",{"$f":"IF(AND(LEFT(D448,1)=\"d\",MID(D448,4,1)=\" \"),RIGHT(D448,LEN(D448)-4),D448)","v":"Pferd"},"das Pferd",null,0,"horse",null,1,{"$f":"RAND()","v":0.07728468174395009},{"$f":"IF(Table24[[#This Row],[Type Here]]=\"\",\"\",IF(Table24[[#This Row],[Type Here]]=Table24[[#This Row],[Answer]],1,-2))","v":""},{"$f":"IF($K$1=1,Table24[[#This Row],[Strength1]],Table24[[#This Row],[Strength2]])","v":1},{"$f":"IF($K$1=1,D448,G448)","v":"horse"},null,{"$f":"IF($K$1=1,IF(E448=\"\",\"\",E448),IF(H448=\"\",\"\",H448))","v":""},{"$f":"IF($K$1=1,G448,D448)","v":"das Pferd"}]
[null,"09-Clothing",{"$f":"IF(AND(LEFT(D449,1)=\"d\",MID(D449,4,1)=\" \"),RIGHT(D449,LEN(D449)-4),D449)","v":"Hose"},"die Hose",null,0,"pants","singular",1,{"$f":"RAND()","v":0.852702384004547},{"$f":"IF(Table24[[#This Row],[Type Here]]=\"\",\"\",IF(Table24[[#This Row],[Type Here]]=Table24[[#This Row],[Answer]],1,-2))","v":""},{"$f":"IF($K$1=1,Table24[[#This Row],[Strength1]],Table24[[#This Row],[Strength2]])","v":1},{"$f":"IF($K$1=1,D449,G449)","v":"pants"},null,{"$f":"IF($K$1=1,IF(E449=\"\",\"\",E449),IF(H449=\"\",\"\",H449))","v":"singular"},{"$f":"IF($K$1=1,G449,D449)","v":"die Hose"}]
[null,"36-Nature",{"$f":"IF(AND(LEFT(D450,1)=\"d\",MID(D450,4,1)=\" \"),RIGHT(D450,LEN(D450)-4),D450)","v":"Wind"},"der Wind",null,0,"wind",null,6,{"$f":"RAND()","v":0.9120445993987008},{"$f":"IF(Table24[[#This Row],[Type Here]]=\"\",\"\",IF(Table24[[#This Row],[Type Here]]=Table24[[#This Row],[Answer]],1,-2))","v":""},{"$f":"IF($K$1=1,Table24[[#This Row],[Strength1]],Table24[[#This Row],[Strength2]])","v":6},{"$f":"IF($K$1=1,D450,G450)","v":"wind"},null,{"$f":"IF($K$1=1,IF(E450=\"\",\"\",E450),IF(H450=\"\",\"\",H450))","v":""},{"$f":"IF($K$1=1,G450,D450)","v":"der Wind"}]
[null,"09-Clothing",{"$f":"IF(AND(LEFT(D451,1)=\"d\",MID(D451,4,1)=\" \"),RIGHT(D451,LEN(D451)-4),D451)","v":"Rock"},"der Rock",null,0,"skirt",null,2,{"$f":"RAND()","v":0.3433599396615369},{"$f":"IF(Table24[[#This Row],[Type Here]]=\"\",\"\",IF(Table24[[#This Row],[Type Here]]=Table24[[#This Row],[Answer]],1,-2))","v":""},{"$f":"IF($K$1=1,Table24[[#This Row],[Strength1]],Table24[[#This Row],[Strength2]])","v":2},{"$f":"IF($K$1=1,D451,G451)","v":"skirt"},null,{"$f":"IF($K$1=1,IF(E451=\"\",\"\",E451),IF(H451=\"\",\"\",H451))","v":""},{"$f":"IF($K$1=1,G451,D451)","v":"der Rock"}]
[null,"07-Adjectives",{"$f":"IF(AND(LEFT(D452,1)=\"d\",MID(D452,4,1)=\" \"),RIGHT(D452,LEN(D452)-4),D452)","v":"perfekt"},"perfekt",null,0,"perfect",null,0,{"$f":"RAND()","v":0.06199340135238662},{"$f":"IF(Table24[[#This Row],[Type Here]]=\"\",\"\",IF(Table24[[#This Row],[Type Here]]=Table24[[#This Row],[Answer]],1,-2))","v":""},{"$f":"IF($K$1=1,Table24[[#This Row],[Strength1]],Table24[[#This Row],[Strength2]])","v":0},{"$f":"IF($K$1=1,D452,G452)","v":"perfect"},null,{"$f":"IF($K$1=1,IF(E452=\"\",\"\",E452),IF(H452=\"\",\"\",H452))","v":""},{"$f":"IF($K$1=1,G452,D452)","v":"perfekt"}]
[null,"07-Adjectives",{"$f":"IF(AND(LEFT(D453,1)=\"d\",MID(D453,4,1)=\" \"),RIGHT(D453,LEN(D453)-4),D453)","v":"klar"},"klar",null,0,"clear",null,0,{"$f":"RAND()","v":0.6580284378409907},{"$f":"IF(Table24[[#This Row],[Type Here]]=\"\",\"\",IF(Table24[[#This Row],[Type Here]]=Table24[[#This Row],[Answer]],1,-2))","v":""},{"$f":"IF($K$1=1,Table24[[#This Row],[Strength1]],Table24[[#This Row],[Strength2]])","v":0},{"$f":"IF($K$1=1,D453,G453)","v":"clear"},null,{"$f":"IF($K$1=1,IF(E453=\"\",\"\",E453),IF(H453=\"\",\"\",H453))","v":""},{"$f":"IF($K$1=1,G453,D453)","v":"klar"}]
[null,"07-Adjectives",{"$f":"IF(AND(LEFT(D454,1)=\"d\",MID(D454,4,1)=\" \"),RIGHT(D454,LEN(D454)-4),D454)","v":"kalt"},"kalt",null,0,"cold",null,0,{"$f":"RAND()","v":0.13457269170543362},{"$f":"IF(Table24[[#This Row],[Type Here]]=\"\",\"\",IF(Table24[[#This Row],[Type Here]]=Table24[[#This Row],[Answer]],1,-2))","v":""},{"$f":"IF($K$1=1,Table24[[#This Row],[Strength1]],Table24[[#This Row],[Strength2]])","v":0},{"$f":"IF($K$1=1,D454,G454)","v":"cold"},null,{"$f":"IF($K$1=1,IF(E454=\"\",\"\",E454),IF(H454=\"\",\"\",H454))","v":""},{"$f":"IF($K$1=1,G454,D454)","v":"kalt"}]
[null,"29-Medical",{"$f":"IF(AND(LEFT(D455,1)=\"d\",MID(D455,4,1)=\" \"),RIGHT(D455,LEN(D455)-4),D455)","v":"Apotheken"},"die Apotheken",null,0,"pharmacies","(chemist's shops)",3,{"$f":"RAND()","v":0.41848029458771074},{"$f":"IF(Table24[[#This Row],[Type Here]]=\"\",\"\",IF(Table24[[#This Row],[Type Here]]=Table24[[#This Row],[Answer]],1,-2))","v":""},{"$f":"IF($K$1=1,Table24[[#This Row],[Strength1]],Table24[[#This Row],[Strength2]])","v":3},{"$f":"IF($K$1=1,D455,G455)","v":"pharmacies"},null,{"$f":"IF($K$1=1,IF(E455=\"\",\"\",E455),IF(H455=\"\",\"\",H455))","v":"(chemist's shops)"},{"$f":"IF($K$1=1,G455,D455)","v":"die Apotheken"}]
[null,"40-Places",{"$f":"IF(AND(LEFT(D456,1)=\"d\",MID(D456,4,1)=\" \"),RIGHT(D456,LEN(D456)-4),D456)","v":"Stadt"},"die Stadt",null,0,"city",null,1,{"$f":"RAND()","v":0.5800096588723592},{"$f":"IF(Table24[[#This Row],[Type Here]]=\"\",\"\",IF(Table24[[#This Row],[Type Here]]=Table24[[#This Row],[Answer]],1,-2))","v":""},{"$f":"IF($K$1=1,Table24[[#This Row],[Strength1]],Table24[[#This Row],[Strength2]])","v":1},{"$f":"IF($K$1=1,D456,G456)","v":"city"},null,{"$f":"IF($K$1=1,IF(E456=\"\",\"\",E456),IF(H456=\"\",\"\",H456))","v":""},{"$f":"IF($K$1=1,G456,D456)","v":"die Stadt"}]
[null,"14-Household",{"$f":"IF(AND(LEFT(D457,1)=\"d\",MID(D457,4,1)=\" \"),RIGHT(D457,LEN(D457)-4),D457)","v":"Raum"},"der Raum",null,0,"room","(space)",0,{"$f":"RAND()","v":0.7478161471738201},{"$f":"IF(Table24[[#This Row],[Type Here]]=\"\",\"\",IF(Table24[[#This Row],[Type Here]]=Table24[[#This Row],[Answer]],1,-2))","v":""},{"$f":"IF($K$1=1,Table24[[#This Row],[Strength1]],Table24[[#This Row],[Strength2]])","v":0},{"$f":"IF($K$1=1,D457,G457)","v":"room"},null,{"$f":"IF($K$1=1,IF(E457=\"\",\"\",E457),IF(H457=\"\",\"\",H457))","v":"(space)"},{"$f":"IF($K$1=1,G457,D457)","v":"der Raum"}]
[null,"12-Acc. Pron.",{"$f":"IF(AND(LEFT(D458,1)=\"d\",MID(D458,4,1)=\" \"),RIGHT(D458,LEN(D458)-4),D458)","v":"das"},"das",null,null,"it","or they (relative pronoun)",null,{"$f":"RAND()","v":0.641023350852996},{"$f":"IF(Table24[[#This Row],[Type Here]]=\"\",\"\",IF(Table24[[#This Row],[Type Here]]=Table24[[#This Row],[Answer]],1,-2))","v":""},{"$f":"IF($K$1=1,Table24[[#This Row],[Strength1]],Table24[[#This Row],[Strength2]])","v":0},{"$f":"IF($K$1=1,D458,G458)","v":"it"},null,{"$f":"IF($K$1=1,IF(E458=\"\",\"\",E458),IF(H458=\"\",\"\",H458))","v":"or they (relative pronoun)"},{"$f":"IF($K$1=1,G458,D458)","v":"das"}]
[null,"08-V. Pres. 1",{"$f":"IF(AND(LEFT(D459,1)=\"d\",MID(D459,4,1)=\" \"),RIGHT(D459,LEN(D459)-4),D459)","v":"bezahlen"},"bezahlen",null,0,"to pay",null,0,{"$f":"RAND()","v":0.23830309305035957},{"$f":"IF(Table24[[#This Row],[Type Here]]=\"\",\"\",IF(Table24[[#This Row],[Type Here]]=Table24[[#This Row],[Answer]],1,-2))","v":""},{"$f":"IF($K$1=1,Table24[[#This Row],[Strength1]],Table24[[#This Row],[Strength2]])","v":0},{"$f":"IF($K$1=1,D459,G459)","v":"to pay"},null,{"$f":"IF($K$1=1,IF(E459=\"\",\"\",E459),IF(H459=\"\",\"\",H459))","v":""},{"$f":"IF($K$1=1,G459,D459)","v":"bezahlen"}]
[null,"33-Adverbs 1",{"$f":"IF(AND(LEFT(D460,1)=\"d\",MID(D460,4,1)=\" \"),RIGHT(D460,LEN(D460)-4),D460)","v":"schon"},"schon",null,0,"already","(less formal, oral)",0,{"$f":"RAND()","v":0.9163443953209449},{"$f":"IF(Table24[[#This Row],[Type Here]]=\"\",\"\",IF(Table24[[#This Row],[Type Here]]=Table24[[#This Row],[Answer]],1,-2))","v":""},{"$f":"IF($K$1=1,Table24[[#This Row],[Strength1]],Table24[[#This Row],[Strength2]])","v":0},{"$f":"IF($K$1=1,D460,G460)","v":"already"},null,{"$f":"IF($K$1=1,IF(E460=\"\",\"\",E460),IF(H460=\"\",\"\",H460))","v":"(less formal, oral)"},{"$f":"IF($K$1=1,G460,D460)","v":"schon"}]
[null,"29-Medical",{"$f":"IF(AND(LEFT(D461,1)=\"d\",MID(D461,4,1)=\" \"),RIGHT(D461,LEN(D461)-4),D461)","v":"Opfer"},"die Opfer",null,0,"victims",null,4,{"$f":"RAND()","v":0.3133868397129995},{"$f":"IF(Table24[[#This Row],[Type Here]]=\"\",\"\",IF(Table24[[#This Row],[Type Here]]=Table24[[#This Row],[Answer]],1,-2))","v":""},{"$f":"IF($K$1=1,Table24[[#This Row],[Strength1]],Table24[[#This Row],[Strength2]])","v":4},{"$f":"IF($K$1=1,D461,G461)","v":"victims"},null,{"$f":"IF($K$1=1,IF(E461=\"\",\"\",E461),IF(H461=\"\",\"\",H461))","v":""},{"$f":"IF($K$1=1,G461,D461)","v":"die Opfer"}]
[null,"11-Family",{"$f":"IF(AND(LEFT(D462,1)=\"d\",MID(D462,4,1)=\" \"),RIGHT(D462,LEN(D462)-4),D462)","v":"Schwestern"},"die Schwestern",null,null,"sisters",null,null,{"$f":"RAND()","v":0.05881639484618517},{"$f":"IF(Table24[[#This Row],[Type Here]]=\"\",\"\",IF(Table24[[#This Row],[Type Here]]=Table24[[#This Row],[Answer]],1,-2))","v":""},{"$f":"IF($K$1=1,Table24[[#This Row],[Strength1]],Table24[[#This Row],[Strength2]])","v":0},{"$f":"IF($K$1=1,D462,G462)","v":"sisters"},null,{"$f":"IF($K$1=1,IF(E462=\"\",\"\",E462),IF(H462=\"\",\"\",H462))","v":""},{"$f":"IF($K$1=1,G462,D462)","v":"die Schwestern"}]
[null,"36-Nature",{"$f":"IF(AND(LEFT(D463,1)=\"d\",MID(D463,4,1)=\" \"),RIGHT(D463,LEN(D463)-4),D463)","v":"Strand"},"der Strand",null,0,"beach",null,7,{"$f":"RAND()","v":0.9994205247946446},{"$f":"IF(Table24[[#This Row],[Type Here]]=\"\",\"\",IF(Table24[[#This Row],[Type Here]]=Table24[[#This Row],[Answer]],1,-2))","v":""},{"$f":"IF($K$1=1,Table24[[#This Row],[Strength1]],Table24[[#This Row],[Strength2]])","v":7},{"$f":"IF($K$1=1,D463,G463)","v":"beach"},null,{"$f":"IF($K$1=1,IF(E463=\"\",\"\",E463),IF(H463=\"\",\"\",H463))","v":""},{"$f":"IF($K$1=1,G463,D463)","v":"der Strand"}]
[null,"36-Nature",{"$f":"IF(AND(LEFT(D464,1)=\"d\",MID(D464,4,1)=\" \"),RIGHT(D464,LEN(D464)-4),D464)","v":"Baum"},"der Baum",null,0,"tree",null,6,{"$f":"RAND()","v":0.8182447635492904},{"$f":"IF(Table24[[#This Row],[Type Here]]=\"\",\"\",IF(Table24[[#This Row],[Type Here]]=Table24[[#This Row],[Answer]],1,-2))","v":""},{"$f":"IF($K$1=1,Table24[[#This Row],[Strength1]],Table24[[#This Row],[Strength2]])","v":6},{"$f":"IF($K$1=1,D464,G464)","v":"tree"},null,{"$f":"IF($K$1=1,IF(E464=\"\",\"\",E464),IF(H464=\"\",\"\",H464))","v":""},{"$f":"IF($K$1=1,G464,D464)","v":"der Baum"}]
[null,"01-Basics 1",{"$f":"IF(AND(LEFT(D465,1)=\"d\",MID(D465,4,1)=\" \"),RIGHT(D465,LEN(D465)-4),D465)","v":"die"},"die","(article - Acc fem)",0,"the","Acc fem",2,{"$f":"RAND()","v":0.4509265637021861},{"$f":"IF(Table24[[#This Row],[Type Here]]=\"\",\"\",IF(Table24[[#This Row],[Type Here]]=Table24[[#This Row],[Answer]],1,-2))","v":""},{"$f":"IF($K$1=1,Table24[[#This Row],[Strength1]],Table24[[#This Row],[Strength2]])","v":2},{"$f":"IF($K$1=1,D465,G465)","v":"the"},null,{"$f":"IF($K$1=1,IF(E465=\"\",\"\",E465),IF(H465=\"\",\"\",H465))","v":"Acc fem"},{"$f":"IF($K$1=1,G465,D465)","v":"die"}]
[null,"36-Nature",{"$f":"IF(AND(LEFT(D466,1)=\"d\",MID(D466,4,1)=\" \"),RIGHT(D466,LEN(D466)-4),D466)","v":"Mond"},"der Mond",null,0,"moon",null,6,{"$f":"RAND()","v":0.5998102134032025},{"$f":"IF(Table24[[#This Row],[Type Here]]=\"\",\"\",IF(Table24[[#This Row],[Type Here]]=Table24[[#This Row],[Answer]],1,-2))","v":""},{"$f":"IF($K$1=1,Table24[[#This Row],[Strength1]],Table24[[#This Row],[Strength2]])","v":6},{"$f":"IF($K$1=1,D466,G466)","v":"moon"},null,{"$f":"IF($K$1=1,IF(E466=\"\",\"\",E466),IF(H466=\"\",\"\",H466))","v":""},{"$f":"IF($K$1=1,G466,D466)","v":"der Mond"}]
[null,"02-Basics 2",{"$f":"IF(AND(LEFT(D467,1)=\"d\",MID(D467,4,1)=\" \"),RIGHT(D467,LEN(D467)-4),D467)","v":"wir sind"},"wir sind",null,0,"we are",null,0,{"$f":"RAND()","v":0.044416879835879386},{"$f":"IF(Table24[[#This Row],[Type Here]]=\"\",\"\",IF(Table24[[#This Row],[Type Here]]=Table24[[#This Row],[Answer]],1,-2))","v":""},{"$f":"IF($K$1=1,Table24[[#This Row],[Strength1]],Table24[[#This Row],[Strength2]])","v":0},{"$f":"IF($K$1=1,D467,G467)","v":"we are"},null,{"$f":"IF($K$1=1,IF(E467=\"\",\"\",E467),IF(H467=\"\",\"\",H467))","v":""},{"$f":"IF($K$1=1,G467,D467)","v":"wir sind"}]
[null,"40-Places",{"$f":"IF(AND(LEFT(D468,1)=\"d\",MID(D468,4,1)=\" \"),RIGHT(D468,LEN(D468)-4),D468)","v":"Straße"},"die Straße",null,0,"street",null,6,{"$f":"RAND()","v":0.8105929241363765},{"$f":"IF(Table24[[#This Row],[Type Here]]=\"\",\"\",IF(Table24[[#This Row],[Type Here]]=Table24[[#This Row],[Answer]],1,-2))","v":""},{"$f":"IF($K$1=1,Table24[[#This Row],[Strength1]],Table24[[#This Row],[Strength2]])","v":6},{"$f":"IF($K$1=1,D468,G468)","v":"street"},null,{"$f":"IF($K$1=1,IF(E468=\"\",\"\",E468),IF(H468=\"\",\"\",H468))","v":""},{"$f":"IF($K$1=1,G468,D468)","v":"die Straße"}]
[null,"14-Household",{"$f":"IF(AND(LEFT(D469,1)=\"d\",MID(D469,4,1)=\" \"),RIGHT(D469,LEN(D469)-4),D469)","v":"Gläser"},"die Gläser",null,0,"glasses",null,0,{"$f":"RAND()","v":0.17136655099766185},{"$f":"IF(Table24[[#This Row],[Type Here]]=\"\",\"\",IF(Table24[[#This Row],[Type Here]]=Table24[[#This Row],[Answer]],1,-2))","v":""},{"$f":"IF($K$1=1,Table24[[#This Row],[Strength1]],Table24[[#This Row],[Strength2]])","v":0},{"$f":"IF($K$1=1,D469,G469)","v":"glasses"},null,{"$f":"IF($K$1=1,IF(E469=\"\",\"\",E469),IF(H469=\"\",\"\",H469))","v":""},{"$f":"IF($K$1=1,G469,D469)","v":"die Gläser"}]
[null,"39-Adj: Acc.",{"$f":"IF(AND(LEFT(D470,1)=\"d\",MID(D470,4,1)=\" \"),RIGHT(D470,LEN(D470)-4),D470)","v":"lang"},"lang",null,0,"long",null,10,{"$f":"RAND()","v":0.5943764649059645},{"$f":"IF(Table24[[#This Row],[Type Here]]=\"\",\"\",IF(Table24[[#This Row],[Type Here]]=Table24[[#This Row],[Answer]],1,-2))","v":""},{"$f":"IF($K$1=1,Table24[[#This Row],[Strength1]],Table24[[#This Row],[Strength2]])","v":10},{"$f":"IF($K$1=1,D470,G470)","v":"long"},null,{"$f":"IF($K$1=1,IF(E470=\"\",\"\",E470),IF(H470=\"\",\"\",H470))","v":""},{"$f":"IF($K$1=1,G470,D470)","v":"lang"}]
[null,"33-Adverbs 1",{"$f":"IF(AND(LEFT(D471,1)=\"d\",MID(D471,4,1)=\" \"),RIGHT(D471,LEN(D471)-4),D471)","v":"sowie"},"sowie",null,0,"as well as",null,0,{"$f":"RAND()","v":0.6332350056911159},{"$f":"IF(Table24[[#This Row],[Type Here]]=\"\",\"\",IF(Table24[[#This Row],[Type Here]]=Table24[[#This Row],[Answer]],1,-2))","v":""},{"$f":"IF($K$1=1,Table24[[#This Row],[Strength1]],Table24[[#This Row],[Strength2]])","v":0},{"$f":"IF($K$1=1,D471,G471)","v":"as well as"},null,{"$f":"IF($K$1=1,IF(E471=\"\",\"\",E471),IF(H471=\"\",\"\",H471))","v":""},{"$f":"IF($K$1=1,G471,D471)","v":"sowie"}]
[null,"10-Nom. Pron.",{"$f":"IF(AND(LEFT(D472,1)=\"d\",MID(D472,4,1)=\" \"),RIGHT(D472,LEN(D472)-4),D472)","v":"sein"},"sein",null,0,"his",null,1,{"$f":"RAND()","v":0.3899443804188495},{"$f":"IF(Table24[[#This Row],[Type Here]]=\"\",\"\",IF(Table24[[#This Row],[Type Here]]=Table24[[#This Row],[Answer]],1,-2))","v":""},{"$f":"IF($K$1=1,Table24[[#This Row],[Strength1]],Table24[[#This Row],[Strength2]])","v":1},{"$f":"IF($K$1=1,D472,G472)","v":"his"},null,{"$f":"IF($K$1=1,IF(E472=\"\",\"\",E472),IF(H472=\"\",\"\",H472))","v":""},{"$f":"IF($K$1=1,G472,D472)","v":"sein"}]
[null,"29-Medical",{"$f":"IF(AND(LEFT(D473,1)=\"d\",MID(D473,4,1)=\" \"),RIGHT(D473,LEN(D473)-4),D473)","v":"Therapie"},"die Therapie",null,0,"therapy",null,5,{"$f":"RAND()","v":0.1915472016679889},{"$f":"IF(Table24[[#This Row],[Type Here]]=\"\",\"\",IF(Table24[[#This Row],[Type Here]]=Table24[[#This Row],[Answer]],1,-2))","v":""},{"$f":"IF($K$1=1,Table24[[#This Row],[Strength1]],Table24[[#This Row],[Strength2]])","v":5},{"$f":"IF($K$1=1,D473,G473)","v":"therapy"},null,{"$f":"IF($K$1=1,IF(E473=\"\",\"\",E473),IF(H473=\"\",\"\",H473))","v":""},{"$f":"IF($K$1=1,G473,D473)","v":"die Therapie"}]
[null,"40-Places",{"$f":"IF(AND(LEFT(D474,1)=\"d\",MID(D474,4,1)=\" \"),RIGHT(D474,LEN(D474)-4),D474)","v":"Bahnhof"},"der Bahnhof",null,0,"station","train station",2,{"$f":"RAND()","v":0.2465212107995558},{"$f":"IF(Table24[[#This Row],[Type Here]]=\"\",\"\",IF(Table24[[#This Row],[Type Here]]=Table24[[#This Row],[Answer]],1,-2))","v":""},{"$f":"IF($K$1=1,Table24[[#This Row],[Strength1]],Table24[[#This Row],[Strength2]])","v":2},{"$f":"IF($K$1=1,D474,G474)","v":"station"},null,{"$f":"IF($K$1=1,IF(E474=\"\",\"\",E474),IF(H474=\"\",\"\",H474))","v":"train station"},{"$f":"IF($K$1=1,G474,D474)","v":"der Bahnhof"}]
[null,"29-Medical",{"$f":"IF(AND(LEFT(D475,1)=\"d\",MID(D475,4,1)=\" \"),RIGHT(D475,LEN(D475)-4),D475)","v":"Füße"},"die Füße",null,0,"feet",null,4,{"$f":"RAND()","v":0.9653449718105863},{"$f":"IF(Table24[[#This Row],[Type Here]]=\"\",\"\",IF(Table24[[#This Row],[Type Here]]=Table24[[#This Row],[Answer]],1,-2))","v":""},{"$f":"IF($K$1=1,Table24[[#This Row],[Strength1]],Table24[[#This Row],[Strength2]])","v":4},{"$f":"IF($K$1=1,D475,G475)","v":"feet"},null,{"$f":"IF($K$1=1,IF(E475=\"\",\"\",E475),IF(H475=\"\",\"\",H475))","v":""},{"$f":"IF($K$1=1,G475,D475)","v":"die Füße"}]
[null,"07-Adjectives",{"$f":"IF(AND(LEFT(D476,1)=\"d\",MID(D476,4,1)=\" \"),RIGHT(D476,LEN(D476)-4),D476)","v":"langsam"},"langsam",null,0,"slow",null,0,{"$f":"RAND()","v":0.9664488691727549},{"$f":"IF(Table24[[#This Row],[Type Here]]=\"\",\"\",IF(Table24[[#This Row],[Type Here]]=Table24[[#This Row],[Answer]],1,-2))","v":""},{"$f":"IF($K$1=1,Table24[[#This Row],[Strength1]],Table24[[#This Row],[Strength2]])","v":0},{"$f":"IF($K$1=1,D476,G476)","v":"slow"},null,{"$f":"IF($K$1=1,IF(E476=\"\",\"\",E476),IF(H476=\"\",\"\",H476))","v":""},{"$f":"IF($K$1=1,G476,D476)","v":"langsam"}]
[null,"07-Adjectives",{"$f":"IF(AND(LEFT(D477,1)=\"d\",MID(D477,4,1)=\" \"),RIGHT(D477,LEN(D477)-4),D477)","v":"weiß"},"weiß",null,0,"white",null,1,{"$f":"RAND()","v":0.35590791081897166},{"$f":"IF(Table24[[#This Row],[Type Here]]=\"\",\"\",IF(Table24[[#This Row],[Type Here]]=Table24[[#This Row],[Answer]],1,-2))","v":""},{"$f":"IF($K$1=1,Table24[[#This Row],[Strength1]],Table24[[#This Row],[Strength2]])","v":1},{"$f":"IF($K$1=1,D477,G477)","v":"white"},null,{"$f":"IF($K$1=1,IF(E477=\"\",\"\",E477),IF(H477=\"\",\"\",H477))","v":""},{"$f":"IF($K$1=1,G477,D477)","v":"weiß"}]
[null,"04-Food",{"$f":"IF(AND(LEFT(D478,1)=\"d\",MID(D478,4,1)=\" \"),RIGHT(D478,LEN(D478)-4),D478)","v":"Fleisch"},"das Fleisch",null,0,"meat",null,0,{"$f":"RAND()","v":0.7512220510773577},{"$f":"IF(Table24[[#This Row],[Type Here]]=\"\",\"\",IF(Table24[[#This Row],[Type Here]]=Table24[[#This Row],[Answer]],1,-2))","v":""},{"$f":"IF($K$1=1,Table24[[#This Row],[Strength1]],Table24[[#This Row],[Strength2]])","v":0},{"$f":"IF($K$1=1,D478,G478)","v":"meat"},null,{"$f":"IF($K$1=1,IF(E478=\"\",\"\",E478),IF(H478=\"\",\"\",H478))","v":""},{"$f":"IF($K$1=1,G478,D478)","v":"das Fleisch"}]
[null,"10-Nom. Pron.",{"$f":"IF(AND(LEFT(D479,1)=\"d\",MID(D479,4,1)=\" \"),RIGHT(D479,LEN(D479)-4),D479)","v":"ihr"},"ihr","3rd pers plural",0,"their",null,1,{"$f":"RAND()","v":0.9731482042669648},{"$f":"IF(Table24[[#This Row],[Type Here]]=\"\",\"\",IF(Table24[[#This Row],[Type Here]]=Table24[[#This Row],[Answer]],1,-2))","v":""},{"$f":"IF($K$1=1,Table24[[#This Row],[Strength1]],Table24[[#This Row],[Strength2]])","v":1},{"$f":"IF($K$1=1,D479,G479)","v":"their"},null,{"$f":"IF($K$1=1,IF(E479=\"\",\"\",E479),IF(H479=\"\",\"\",H479))","v":""},{"$f":"IF($K$1=1,G479,D479)","v":"ihr"}]
[null,"01-Basics 1",{"$f":"IF(AND(LEFT(D480,1)=\"d\",MID(D480,4,1)=\" \"),RIGHT(D480,LEN(D480)-4),D480)","v":"das"},"das","(article - Acc neut)",0,"the","Acc neut",1,{"$f":"RAND()","v":0.8302810959251192},{"$f":"IF(Table24[[#This Row],[Type Here]]=\"\",\"\",IF(Table24[[#This Row],[Type Here]]=Table24[[#This Row],[Answer]],1,-2))","v":""},{"$f":"IF($K$1=1,Table24[[#This Row],[Strength1]],Table24[[#This Row],[Strength2]])","v":1},{"$f":"IF($K$1=1,D480,G480)","v":"the"},null,{"$f":"IF($K$1=1,IF(E480=\"\",\"\",E480),IF(H480=\"\",\"\",H480))","v":"Acc neut"},{"$f":"IF($K$1=1,G480,D480)","v":"das"}]
[null,"11-Family",{"$f":"IF(AND(LEFT(D481,1)=\"d\",MID(D481,4,1)=\" \"),RIGHT(D481,LEN(D481)-4),D481)","v":"Söhne"},"die Söhne",null,null,"sons",null,null,{"$f":"RAND()","v":0.9028874462958945},{"$f":"IF(Table24[[#This Row],[Type Here]]=\"\",\"\",IF(Table24[[#This Row],[Type Here]]=Table24[[#This Row],[Answer]],1,-2))","v":""},{"$f":"IF($K$1=1,Table24[[#This Row],[Strength1]],Table24[[#This Row],[Strength2]])","v":0},{"$f":"IF($K$1=1,D481,G481)","v":"sons"},null,{"$f":"IF($K$1=1,IF(E481=\"\",\"\",E481),IF(H481=\"\",\"\",H481))","v":""},{"$f":"IF($K$1=1,G481,D481)","v":"die Söhne"}]
[null,"36-Nature",{"$f":"IF(AND(LEFT(D482,1)=\"d\",MID(D482,4,1)=\" \"),RIGHT(D482,LEN(D482)-4),D482)","v":"Chemie"},"die Chemie",null,0,"chemistry",null,6,{"$f":"RAND()","v":0.9997300786570175},{"$f":"IF(Table24[[#This Row],[Type Here]]=\"\",\"\",IF(Table24[[#This Row],[Type Here]]=Table24[[#This Row],[Answer]],1,-2))","v":""},{"$f":"IF($K$1=1,Table24[[#This Row],[Strength1]],Table24[[#This Row],[Strength2]])","v":6},{"$f":"IF($K$1=1,D482,G482)","v":"chemistry"},null,{"$f":"IF($K$1=1,IF(E482=\"\",\"\",E482),IF(H482=\"\",\"\",H482))","v":""},{"$f":"IF($K$1=1,G482,D482)","v":"die Chemie"}]
[null,"14-Household",{"$f":"IF(AND(LEFT(D483,1)=\"d\",MID(D483,4,1)=\" \"),RIGHT(D483,LEN(D483)-4),D483)","v":"Türen"},"die Türen",null,0,"doors",null,2,{"$f":"RAND()","v":0.24647755008215866},{"$f":"IF(Table24[[#This Row],[Type Here]]=\"\",\"\",IF(Table24[[#This Row],[Type Here]]=Table24[[#This Row],[Answer]],1,-2))","v":""},{"$f":"IF($K$1=1,Table24[[#This Row],[Strength1]],Table24[[#This Row],[Strength2]])","v":2},{"$f":"IF($K$1=1,D483,G483)","v":"doors"},null,{"$f":"IF($K$1=1,IF(E483=\"\",\"\",E483),IF(H483=\"\",\"\",H483))","v":""},{"$f":"IF($K$1=1,G483,D483)","v":"die Türen"}]
[null,"29-Medical",{"$f":"IF(AND(LEFT(D484,1)=\"d\",MID(D484,4,1)=\" \"),RIGHT(D484,LEN(D484)-4),D484)","v":"Auge"},"das Auge",null,0,"eye","noun",5,{"$f":"RAND()","v":0.7985875282261549},{"$f":"IF(Table24[[#This Row],[Type Here]]=\"\",\"\",IF(Table24[[#This Row],[Type Here]]=Table24[[#This Row],[Answer]],1,-2))","v":""},{"$f":"IF($K$1=1,Table24[[#This Row],[Strength1]],Table24[[#This Row],[Strength2]])","v":5},{"$f":"IF($K$1=1,D484,G484)","v":"eye"},null,{"$f":"IF($K$1=1,IF(E484=\"\",\"\",E484),IF(H484=\"\",\"\",H484))","v":"noun"},{"$f":"IF($K$1=1,G484,D484)","v":"das Auge"}]
[null,"29-Medical",{"$f":"IF(AND(LEFT(D485,1)=\"d\",MID(D485,4,1)=\" \"),RIGHT(D485,LEN(D485)-4),D485)","v":"Notfälle"},"die Notfälle",null,-1,"emergencies","(medical emergencies)",4,{"$f":"RAND()","v":0.0199291379253842},{"$f":"IF(Table24[[#This Row],[Type Here]]=\"\",\"\",IF(Table24[[#This Row],[Type Here]]=Table24[[#This Row],[Answer]],1,-2))","v":""},{"$f":"IF($K$1=1,Table24[[#This Row],[Strength1]],Table24[[#This Row],[Strength2]])","v":4},{"$f":"IF($K$1=1,D485,G485)","v":"emergencies"},null,{"$f":"IF($K$1=1,IF(E485=\"\",\"\",E485),IF(H485=\"\",\"\",H485))","v":"(medical emergencies)"},{"$f":"IF($K$1=1,G485,D485)","v":"die Notfälle"}]
[null,"14-Household",{"$f":"IF(AND(LEFT(D486,1)=\"d\",MID(D486,4,1)=\" \"),RIGHT(D486,LEN(D486)-4),D486)","v":"Bau"},"der Bau",null,0,"building",null,2,{"$f":"RAND()","v":0.9651931300723208},{"$f":"IF(Table24[[#This Row],[Type Here]]=\"\",\"\",IF(Table24[[#This Row],[Type Here]]=Table24[[#This Row],[Answer]],1,-2))","v":""},{"$f":"IF($K$1=1,Table24[[#This Row],[Strength1]],Table24[[#This Row],[Strength2]])","v":2},{"$f":"IF($K$1=1,D486,G486)","v":"building"},null,{"$f":"IF($K$1=1,IF(E486=\"\",\"\",E486),IF(H486=\"\",\"\",H486))","v":""},{"$f":"IF($K$1=1,G486,D486)","v":"der Bau"}]
[null,"01-Basics 1",{"$f":"IF(AND(LEFT(D487,1)=\"d\",MID(D487,4,1)=\" \"),RIGHT(D487,LEN(D487)-4),D487)","v":"ich trinke"},"ich trinke",null,0,"I drink",null,0,{"$f":"RAND()","v":0.7851858080454803},{"$f":"IF(Table24[[#This Row],[Type Here]]=\"\",\"\",IF(Table24[[#This Row],[Type Here]]=Table24[[#This Row],[Answer]],1,-2))","v":""},{"$f":"IF($K$1=1,Table24[[#This Row],[Strength1]],Table24[[#This Row],[Strength2]])","v":0},{"$f":"IF($K$1=1,D487,G487)","v":"I drink"},null,{"$f":"IF($K$1=1,IF(E487=\"\",\"\",E487),IF(H487=\"\",\"\",H487))","v":""},{"$f":"IF($K$1=1,G487,D487)","v":"ich trinke"}]
[null,"11-Family",{"$f":"IF(AND(LEFT(D488,1)=\"d\",MID(D488,4,1)=\" \"),RIGHT(D488,LEN(D488)-4),D488)","v":"Partnerschaften"},"die Partnerschaften",null,null,"partnerships",null,null,{"$f":"RAND()","v":0.522493580788584},{"$f":"IF(Table24[[#This Row],[Type Here]]=\"\",\"\",IF(Table24[[#This Row],[Type Here]]=Table24[[#This Row],[Answer]],1,-2))","v":""},{"$f":"IF($K$1=1,Table24[[#This Row],[Strength1]],Table24[[#This Row],[Strength2]])","v":0},{"$f":"IF($K$1=1,D488,G488)","v":"partnerships"},null,{"$f":"IF($K$1=1,IF(E488=\"\",\"\",E488),IF(H488=\"\",\"\",H488))","v":""},{"$f":"IF($K$1=1,G488,D488)","v":"die Partnerschaften"}]
[null,"11-Family",{"$f":"IF(AND(LEFT(D489,1)=\"d\",MID(D489,4,1)=\" \"),RIGHT(D489,LEN(D489)-4),D489)","v":"Hochzeiten"},"die Hochzeiten",null,null,"weddings",null,null,{"$f":"RAND()","v":0.4449258448201133},{"$f":"IF(Table24[[#This Row],[Type Here]]=\"\",\"\",IF(Table24[[#This Row],[Type Here]]=Table24[[#This Row],[Answer]],1,-2))","v":""},{"$f":"IF($K$1=1,Table24[[#This Row],[Strength1]],Table24[[#This Row],[Strength2]])","v":0},{"$f":"IF($K$1=1,D489,G489)","v":"weddings"},null,{"$f":"IF($K$1=1,IF(E489=\"\",\"\",E489),IF(H489=\"\",\"\",H489))","v":""},{"$f":"IF($K$1=1,G489,D489)","v":"die Hochzeiten"}]
[null,"08-V. Pres. 1",{"$f":"IF(AND(LEFT(D490,1)=\"d\",MID(D490,4,1)=\" \"),RIGHT(D490,LEN(D490)-4),D490)","v":"waschen"},"waschen",null,0,"to wash",null,0,{"$f":"RAND()","v":0.761601756871366},{"$f":"IF(Table24[[#This Row],[Type Here]]=\"\",\"\",IF(Table24[[#This Row],[Type Here]]=Table24[[#This Row],[Answer]],1,-2))","v":""},{"$f":"IF($K$1=1,Table24[[#This Row],[Strength1]],Table24[[#This Row],[Strength2]])","v":0},{"$f":"IF($K$1=1,D490,G490)","v":"to wash"},null,{"$f":"IF($K$1=1,IF(E490=\"\",\"\",E490),IF(H490=\"\",\"\",H490))","v":""},{"$f":"IF($K$1=1,G490,D490)","v":"waschen"}]
[null,"11-Family",{"$f":"IF(AND(LEFT(D491,1)=\"d\",MID(D491,4,1)=\" \"),RIGHT(D491,LEN(D491)-4),D491)","v":"Familien"},"die Familien",null,null,"families",null,null,{"$f":"RAND()","v":0.3843309022964603},{"$f":"IF(Table24[[#This Row],[Type Here]]=\"\",\"\",IF(Table24[[#This Row],[Type Here]]=Table24[[#This Row],[Answer]],1,-2))","v":""},{"$f":"IF($K$1=1,Table24[[#This Row],[Strength1]],Table24[[#This Row],[Strength2]])","v":0},{"$f":"IF($K$1=1,D491,G491)","v":"families"},null,{"$f":"IF($K$1=1,IF(E491=\"\",\"\",E491),IF(H491=\"\",\"\",H491))","v":""},{"$f":"IF($K$1=1,G491,D491)","v":"die Familien"}]
[null,"07-Adjectives",{"$f":"IF(AND(LEFT(D492,1)=\"d\",MID(D492,4,1)=\" \"),RIGHT(D492,LEN(D492)-4),D492)","v":"teuer"},"teuer",null,0,"expensive","costly",0,{"$f":"RAND()","v":0.47831966306459284},{"$f":"IF(Table24[[#This Row],[Type Here]]=\"\",\"\",IF(Table24[[#This Row],[Type Here]]=Table24[[#This Row],[Answer]],1,-2))","v":""},{"$f":"IF($K$1=1,Table24[[#This Row],[Strength1]],Table24[[#This Row],[Strength2]])","v":0},{"$f":"IF($K$1=1,D492,G492)","v":"expensive"},null,{"$f":"IF($K$1=1,IF(E492=\"\",\"\",E492),IF(H492=\"\",\"\",H492))","v":"costly"},{"$f":"IF($K$1=1,G492,D492)","v":"teuer"}]
[null,"29-Medical",{"$f":"IF(AND(LEFT(D493,1)=\"d\",MID(D493,4,1)=\" \"),RIGHT(D493,LEN(D493)-4),D493)","v":"Therapien"},"die Therapien",null,0,"therapies",null,4,{"$f":"RAND()","v":0.5279434853706405},{"$f":"IF(Table24[[#This Row],[Type Here]]=\"\",\"\",IF(Table24[[#This Row],[Type Here]]=Table24[[#This Row],[Answer]],1,-2))","v":""},{"$f":"IF($K$1=1,Table24[[#This Row],[Strength1]],Table24[[#This Row],[Strength2]])","v":4},{"$f":"IF($K$1=1,D493,G493)","v":"therapies"},null,{"$f":"IF($K$1=1,IF(E493=\"\",\"\",E493),IF(H493=\"\",\"\",H493))","v":""},{"$f":"IF($K$1=1,G493,D493)","v":"die Therapien"}]
[null,"29-Medical",{"$f":"IF(AND(LEFT(D494,1)=\"d\",MID(D494,4,1)=\" \"),RIGHT(D494,LEN(D494)-4),D494)","v":"Krankenwagen"},"die Krankenwagen",null,0,"ambulances",null,4,{"$f":"RAND()","v":0.13946596541210832},{"$f":"IF(Table24[[#This Row],[Type Here]]=\"\",\"\",IF(Table24[[#This Row],[Type Here]]=Table24[[#This Row],[Answer]],1,-2))","v":""},{"$f":"IF($K$1=1,Table24[[#This Row],[Strength1]],Table24[[#This Row],[Strength2]])","v":4},{"$f":"IF($K$1=1,D494,G494)","v":"ambulances"},null,{"$f":"IF($K$1=1,IF(E494=\"\",\"\",E494),IF(H494=\"\",\"\",H494))","v":""},{"$f":"IF($K$1=1,G494,D494)","v":"die Krankenwagen"}]
[null,"22-Colors",{"$f":"IF(AND(LEFT(D495,1)=\"d\",MID(D495,4,1)=\" \"),RIGHT(D495,LEN(D495)-4),D495)","v":"Farben"},"die Farben",null,0,"colors","noun",1,{"$f":"RAND()","v":0.6263441656447033},{"$f":"IF(Table24[[#This Row],[Type Here]]=\"\",\"\",IF(Table24[[#This Row],[Type Here]]=Table24[[#This Row],[Answer]],1,-2))","v":""},{"$f":"IF($K$1=1,Table24[[#This Row],[Strength1]],Table24[[#This Row],[Strength2]])","v":1},{"$f":"IF($K$1=1,D495,G495)","v":"colors"},null,{"$f":"IF($K$1=1,IF(E495=\"\",\"\",E495),IF(H495=\"\",\"\",H495))","v":"noun"},{"$f":"IF($K$1=1,G495,D495)","v":"die Farben"}]
[null,"12-Acc. Pron.",{"$f":"IF(AND(LEFT(D496,1)=\"d\",MID(D496,4,1)=\" \"),RIGHT(D496,LEN(D496)-4),D496)","v":"jed"},"jed",null,null,"any","every (always inflected)",null,{"$f":"RAND()","v":0.18015193587407985},{"$f":"IF(Table24[[#This Row],[Type Here]]=\"\",\"\",IF(Table24[[#This Row],[Type Here]]=Table24[[#This Row],[Answer]],1,-2))","v":""},{"$f":"IF($K$1=1,Table24[[#This Row],[Strength1]],Table24[[#This Row],[Strength2]])","v":0},{"$f":"IF($K$1=1,D496,G496)","v":"any"},null,{"$f":"IF($K$1=1,IF(E496=\"\",\"\",E496),IF(H496=\"\",\"\",H496))","v":"every (always inflected)"},{"$f":"IF($K$1=1,G496,D496)","v":"jed"}]
[null,"01-Basics 1",{"$f":"IF(AND(LEFT(D497,1)=\"d\",MID(D497,4,1)=\" \"),RIGHT(D497,LEN(D497)-4),D497)","v":"Brote"},"die Brote",null,0,"breads","(noun)",0,{"$f":"RAND()","v":0.15957989762405445},{"$f":"IF(Table24[[#This Row],[Type Here]]=\"\",\"\",IF(Table24[[#This Row],[Type Here]]=Table24[[#This Row],[Answer]],1,-2))","v":""},{"$f":"IF($K$1=1,Table24[[#This Row],[Strength1]],Table24[[#This Row],[Strength2]])","v":0},{"$f":"IF($K$1=1,D497,G497)","v":"breads"},null,{"$f":"IF($K$1=1,IF(E497=\"\",\"\",E497),IF(H497=\"\",\"\",H497))","v":"(noun)"},{"$f":"IF($K$1=1,G497,D497)","v":"die Brote"}]
[null,"38-Ad: Nom. 1",{"$f":"IF(AND(LEFT(D498,1)=\"d\",MID(D498,4,1)=\" \"),RIGHT(D498,LEN(D498)-4),D498)","v":"jugendlich"},"jugendlich",null,0,"adolescent","(teenage)",3,{"$f":"RAND()","v":0.4120432342240845},{"$f":"IF(Table24[[#This Row],[Type Here]]=\"\",\"\",IF(Table24[[#This Row],[Type Here]]=Table24[[#This Row],[Answer]],1,-2))","v":""},{"$f":"IF($K$1=1,Table24[[#This Row],[Strength1]],Table24[[#This Row],[Strength2]])","v":3},{"$f":"IF($K$1=1,D498,G498)","v":"adolescent"},null,{"$f":"IF($K$1=1,IF(E498=\"\",\"\",E498),IF(H498=\"\",\"\",H498))","v":"(teenage)"},{"$f":"IF($K$1=1,G498,D498)","v":"jugendlich"}]
[null,"33-Adverbs 1",{"$f":"IF(AND(LEFT(D499,1)=\"d\",MID(D499,4,1)=\" \"),RIGHT(D499,LEN(D499)-4),D499)","v":"einmal"},"einmal",null,0,"once",null,0,{"$f":"RAND()","v":0.09988530987884447},{"$f":"IF(Table24[[#This Row],[Type Here]]=\"\",\"\",IF(Table24[[#This Row],[Type Here]]=Table24[[#This Row],[Answer]],1,-2))","v":""},{"$f":"IF($K$1=1,Table24[[#This Row],[Strength1]],Table24[[#This Row],[Strength2]])","v":0},{"$f":"IF($K$1=1,D499,G499)","v":"once"},null,{"$f":"IF($K$1=1,IF(E499=\"\",\"\",E499),IF(H499=\"\",\"\",H499))","v":""},{"$f":"IF($K$1=1,G499,D499)","v":"einmal"}]
[null,"14-Household",{"$f":"IF(AND(LEFT(D500,1)=\"d\",MID(D500,4,1)=\" \"),RIGHT(D500,LEN(D500)-4),D500)","v":"Haushalt"},"der Haushalt",null,0,"household",null,-2,{"$f":"RAND()","v":0.5287192030091514},{"$f":"IF(Table24[[#This Row],[Type Here]]=\"\",\"\",IF(Table24[[#This Row],[Type Here]]=Table24[[#This Row],[Answer]],1,-2))","v":""},{"$f":"IF($K$1=1,Table24[[#This Row],[Strength1]],Table24[[#This Row],[Strength2]])","v":-2},{"$f":"IF($K$1=1,D500,G500)","v":"household"},null,{"$f":"IF($K$1=1,IF(E500=\"\",\"\",E500),IF(H500=\"\",\"\",H500))","v":""},{"$f":"IF($K$1=1,G500,D500)","v":"der Haushalt"}]
[null,"06-Plurals",{"$f":"IF(AND(LEFT(D501,1)=\"d\",MID(D501,4,1)=\" \"),RIGHT(D501,LEN(D501)-4),D501)","v":"Bücher"},"die Bücher",null,0,"books",null,2,{"$f":"RAND()","v":0.006499582538186943},{"$f":"IF(Table24[[#This Row],[Type Here]]=\"\",\"\",IF(Table24[[#This Row],[Type Here]]=Table24[[#This Row],[Answer]],1,-2))","v":""},{"$f":"IF($K$1=1,Table24[[#This Row],[Strength1]],Table24[[#This Row],[Strength2]])","v":2},{"$f":"IF($K$1=1,D501,G501)","v":"books"},null,{"$f":"IF($K$1=1,IF(E501=\"\",\"\",E501),IF(H501=\"\",\"\",H501))","v":""},{"$f":"IF($K$1=1,G501,D501)","v":"die Bücher"}]
[null,"06-Plurals",{"$f":"IF(AND(LEFT(D502,1)=\"d\",MID(D502,4,1)=\" \"),RIGHT(D502,LEN(D502)-4),D502)","v":"Katzen"},"die Katzen",null,0,"cats",null,1,{"$f":"RAND()","v":0.8400513751463781},{"$f":"IF(Table24[[#This Row],[Type Here]]=\"\",\"\",IF(Table24[[#This Row],[Type Here]]=Table24[[#This Row],[Answer]],1,-2))","v":""},{"$f":"IF($K$1=1,Table24[[#This Row],[Strength1]],Table24[[#This Row],[Strength2]])","v":1},{"$f":"IF($K$1=1,D502,G502)","v":"cats"},null,{"$f":"IF($K$1=1,IF(E502=\"\",\"\",E502),IF(H502=\"\",\"\",H502))","v":""},{"$f":"IF($K$1=1,G502,D502)","v":"die Katzen"}]
[null,"33-Adverbs 1",{"$f":"IF(AND(LEFT(D503,1)=\"d\",MID(D503,4,1)=\" \"),RIGHT(D503,LEN(D503)-4),D503)","v":"je"},"je",null,0,"ever",null,0,{"$f":"RAND()","v":0.20349665535479244},{"$f":"IF(Table24[[#This Row],[Type Here]]=\"\",\"\",IF(Table24[[#This Row],[Type Here]]=Table24[[#This Row],[Answer]],1,-2))","v":""},{"$f":"IF($K$1=1,Table24[[#This Row],[Strength1]],Table24[[#This Row],[Strength2]])","v":0},{"$f":"IF($K$1=1,D503,G503)","v":"ever"},null,{"$f":"IF($K$1=1,IF(E503=\"\",\"\",E503),IF(H503=\"\",\"\",H503))","v":""},{"$f":"IF($K$1=1,G503,D503)","v":"je"}]
[null,"07-Adjectives",{"$f":"IF(AND(LEFT(D504,1)=\"d\",MID(D504,4,1)=\" \"),RIGHT(D504,LEN(D504)-4),D504)","v":"genau"},"genau",null,0,"exact","accurate, precise",0,{"$f":"RAND()","v":0.19041150691159825},{"$f":"IF(Table24[[#This Row],[Type Here]]=\"\",\"\",IF(Table24[[#This Row],[Type Here]]=Table24[[#This Row],[Answer]],1,-2))","v":""},{"$f":"IF($K$1=1,Table24[[#This Row],[Strength1]],Table24[[#This Row],[Strength2]])","v":0},{"$f":"IF($K$1=1,D504,G504)","v":"exact"},null,{"$f":"IF($K$1=1,IF(E504=\"\",\"\",E504),IF(H504=\"\",\"\",H504))","v":"accurate, precise"},{"$f":"IF($K$1=1,G504,D504)","v":"genau"}]
[null,"38-Ad: Nom. 1",{"$f":"IF(AND(LEFT(D505,1)=\"d\",MID(D505,4,1)=\" \"),RIGHT(D505,LEN(D505)-4),D505)","v":"privat"},"privat",null,0,"private",null,3,{"$f":"RAND()","v":0.8311670392624457},{"$f":"IF(Table24[[#This Row],[Type Here]]=\"\",\"\",IF(Table24[[#This Row],[Type Here]]=Table24[[#This Row],[Answer]],1,-2))","v":""},{"$f":"IF($K$1=1,Table24[[#This Row],[Strength1]],Table24[[#This Row],[Strength2]])","v":3},{"$f":"IF($K$1=1,D505,G505)","v":"private"},null,{"$f":"IF($K$1=1,IF(E505=\"\",\"\",E505),IF(H505=\"\",\"\",H505))","v":""},{"$f":"IF($K$1=1,G505,D505)","v":"privat"}]
[null,"38-Ad: Nom. 1",{"$f":"IF(AND(LEFT(D506,1)=\"d\",MID(D506,4,1)=\" \"),RIGHT(D506,LEN(D506)-4),D506)","v":"link"},"link",null,0,"left","(side of sth)",3,{"$f":"RAND()","v":0.567886620177821},{"$f":"IF(Table24[[#This Row],[Type Here]]=\"\",\"\",IF(Table24[[#This Row],[Type Here]]=Table24[[#This Row],[Answer]],1,-2))","v":""},{"$f":"IF($K$1=1,Table24[[#This Row],[Strength1]],Table24[[#This Row],[Strength2]])","v":3},{"$f":"IF($K$1=1,D506,G506)","v":"left"},null,{"$f":"IF($K$1=1,IF(E506=\"\",\"\",E506),IF(H506=\"\",\"\",H506))","v":"(side of sth)"},{"$f":"IF($K$1=1,G506,D506)","v":"link"}]
[null,"10-Nom. Pron.",{"$f":"IF(AND(LEFT(D507,1)=\"d\",MID(D507,4,1)=\" \"),RIGHT(D507,LEN(D507)-4),D507)","v":"manche"},"manche",null,0,"some",null,1,{"$f":"RAND()","v":0.03213555937060142},{"$f":"IF(Table24[[#This Row],[Type Here]]=\"\",\"\",IF(Table24[[#This Row],[Type Here]]=Table24[[#This Row],[Answer]],1,-2))","v":""},{"$f":"IF($K$1=1,Table24[[#This Row],[Strength1]],Table24[[#This Row],[Strength2]])","v":1},{"$f":"IF($K$1=1,D507,G507)","v":"some"},null,{"$f":"IF($K$1=1,IF(E507=\"\",\"\",E507),IF(H507=\"\",\"\",H507))","v":""},{"$f":"IF($K$1=1,G507,D507)","v":"manche"}]
[null,"40-Places",{"$f":"IF(AND(LEFT(D508,1)=\"d\",MID(D508,4,1)=\" \"),RIGHT(D508,LEN(D508)-4),D508)","v":"Insel"},"die Insel",null,0,"island",null,0,{"$f":"RAND()","v":0.17538059157929053},{"$f":"IF(Table24[[#This Row],[Type Here]]=\"\",\"\",IF(Table24[[#This Row],[Type Here]]=Table24[[#This Row],[Answer]],1,-2))","v":""},{"$f":"IF($K$1=1,Table24[[#This Row],[Strength1]],Table24[[#This Row],[Strength2]])","v":0},{"$f":"IF($K$1=1,D508,G508)","v":"island"},null,{"$f":"IF($K$1=1,IF(E508=\"\",\"\",E508),IF(H508=\"\",\"\",H508))","v":""},{"$f":"IF($K$1=1,G508,D508)","v":"die Insel"}]
[null,"29-Medical",{"$f":"IF(AND(LEFT(D509,1)=\"d\",MID(D509,4,1)=\" \"),RIGHT(D509,LEN(D509)-4),D509)","v":"Gesicht"},"das Gesicht",null,0,"face","anatomy",0,{"$f":"RAND()","v":0.848967290744108},{"$f":"IF(Table24[[#This Row],[Type Here]]=\"\",\"\",IF(Table24[[#This Row],[Type Here]]=Table24[[#This Row],[Answer]],1,-2))","v":""},{"$f":"IF($K$1=1,Table24[[#This Row],[Strength1]],Table24[[#This Row],[Strength2]])","v":0},{"$f":"IF($K$1=1,D509,G509)","v":"face"},null,{"$f":"IF($K$1=1,IF(E509=\"\",\"\",E509),IF(H509=\"\",\"\",H509))","v":"anatomy"},{"$f":"IF($K$1=1,G509,D509)","v":"das Gesicht"}]
[null,"40-Places",{"$f":"IF(AND(LEFT(D510,1)=\"d\",MID(D510,4,1)=\" \"),RIGHT(D510,LEN(D510)-4),D510)","v":"Ort"},"der Ort",null,0,"place","scene",-5,{"$f":"RAND()","v":0.9830427530846526},{"$f":"IF(Table24[[#This Row],[Type Here]]=\"\",\"\",IF(Table24[[#This Row],[Type Here]]=Table24[[#This Row],[Answer]],1,-2))","v":""},{"$f":"IF($K$1=1,Table24[[#This Row],[Strength1]],Table24[[#This Row],[Strength2]])","v":-5},{"$f":"IF($K$1=1,D510,G510)","v":"place"},null,{"$f":"IF($K$1=1,IF(E510=\"\",\"\",E510),IF(H510=\"\",\"\",H510))","v":"scene"},{"$f":"IF($K$1=1,G510,D510)","v":"der Ort"}]
[null,"14-Household",{"$f":"IF(AND(LEFT(D511,1)=\"d\",MID(D511,4,1)=\" \"),RIGHT(D511,LEN(D511)-4),D511)","v":"Werkzeug"},"das Werkzeug",null,0,"tool",null,0,{"$f":"RAND()","v":0.46252493819122487},{"$f":"IF(Table24[[#This Row],[Type Here]]=\"\",\"\",IF(Table24[[#This Row],[Type Here]]=Table24[[#This Row],[Answer]],1,-2))","v":""},{"$f":"IF($K$1=1,Table24[[#This Row],[Strength1]],Table24[[#This Row],[Strength2]])","v":0},{"$f":"IF($K$1=1,D511,G511)","v":"tool"},null,{"$f":"IF($K$1=1,IF(E511=\"\",\"\",E511),IF(H511=\"\",\"\",H511))","v":""},{"$f":"IF($K$1=1,G511,D511)","v":"das Werkzeug"}]
[null,"04-Food",{"$f":"IF(AND(LEFT(D512,1)=\"d\",MID(D512,4,1)=\" \"),RIGHT(D512,LEN(D512)-4),D512)","v":"Tee"},"der Tee",null,0,"tea",null,4,{"$f":"RAND()","v":0.7680260654661433},{"$f":"IF(Table24[[#This Row],[Type Here]]=\"\",\"\",IF(Table24[[#This Row],[Type Here]]=Table24[[#This Row],[Answer]],1,-2))","v":""},{"$f":"IF($K$1=1,Table24[[#This Row],[Strength1]],Table24[[#This Row],[Strength2]])","v":4},{"$f":"IF($K$1=1,D512,G512)","v":"tea"},null,{"$f":"IF($K$1=1,IF(E512=\"\",\"\",E512),IF(H512=\"\",\"\",H512))","v":""},{"$f":"IF($K$1=1,G512,D512)","v":"der Tee"}]
[null,"14-Household",{"$f":"IF(AND(LEFT(D513,1)=\"d\",MID(D513,4,1)=\" \"),RIGHT(D513,LEN(D513)-4),D513)","v":"Rasierer"},"die Rasierer",null,0,"razors",null,1,{"$f":"RAND()","v":0.5228825680359781},{"$f":"IF(Table24[[#This Row],[Type Here]]=\"\",\"\",IF(Table24[[#This Row],[Type Here]]=Table24[[#This Row],[Answer]],1,-2))","v":""},{"$f":"IF($K$1=1,Table24[[#This Row],[Strength1]],Table24[[#This Row],[Strength2]])","v":1},{"$f":"IF($K$1=1,D513,G513)","v":"razors"},null,{"$f":"IF($K$1=1,IF(E513=\"\",\"\",E513),IF(H513=\"\",\"\",H513))","v":""},{"$f":"IF($K$1=1,G513,D513)","v":"die Rasierer"}]
[null,"29-Medical",{"$f":"IF(AND(LEFT(D514,1)=\"d\",MID(D514,4,1)=\" \"),RIGHT(D514,LEN(D514)-4),D514)","v":"Notfall"},"der Notfall",null,0,"emergency","(medical emergency)",1,{"$f":"RAND()","v":0.009019654107859432},{"$f":"IF(Table24[[#This Row],[Type Here]]=\"\",\"\",IF(Table24[[#This Row],[Type Here]]=Table24[[#This Row],[Answer]],1,-2))","v":""},{"$f":"IF($K$1=1,Table24[[#This Row],[Strength1]],Table24[[#This Row],[Strength2]])","v":1},{"$f":"IF($K$1=1,D514,G514)","v":"emergency"},null,{"$f":"IF($K$1=1,IF(E514=\"\",\"\",E514),IF(H514=\"\",\"\",H514))","v":"(medical emergency)"},{"$f":"IF($K$1=1,G514,D514)","v":"der Notfall"}]
[null,"40-Places",{"$f":"IF(AND(LEFT(D515,1)=\"d\",MID(D515,4,1)=\" \"),RIGHT(D515,LEN(D515)-4),D515)","v":"Unterkunft"},"die Unterkunft",null,0,"housing",null,0,{"$f":"RAND()","v":0.34055926998032415},{"$f":"IF(Table24[[#This Row],[Type Here]]=\"\",\"\",IF(Table24[[#This Row],[Type Here]]=Table24[[#This Row],[Answer]],1,-2))","v":""},{"$f":"IF($K$1=1,Table24[[#This Row],[Strength1]],Table24[[#This Row],[Strength2]])","v":0},{"$f":"IF($K$1=1,D515,G515)","v":"housing"},null,{"$f":"IF($K$1=1,IF(E515=\"\",\"\",E515),IF(H515=\"\",\"\",H515))","v":""},{"$f":"IF($K$1=1,G515,D515)","v":"die Unterkunft"}]
[null,"29-Medical",{"$f":"IF(AND(LEFT(D516,1)=\"d\",MID(D516,4,1)=\" \"),RIGHT(D516,LEN(D516)-4),D516)","v":"Häute"},"die Häute",null,0,"skins","anatomy",0,{"$f":"RAND()","v":0.23917572504756868},{"$f":"IF(Table24[[#This Row],[Type Here]]=\"\",\"\",IF(Table24[[#This Row],[Type Here]]=Table24[[#This Row],[Answer]],1,-2))","v":""},{"$f":"IF($K$1=1,Table24[[#This Row],[Strength1]],Table24[[#This Row],[Strength2]])","v":0},{"$f":"IF($K$1=1,D516,G516)","v":"skins"},null,{"$f":"IF($K$1=1,IF(E516=\"\",\"\",E516),IF(H516=\"\",\"\",H516))","v":"anatomy"},{"$f":"IF($K$1=1,G516,D516)","v":"die Häute"}]
[null,"11-Family",{"$f":"IF(AND(LEFT(D517,1)=\"d\",MID(D517,4,1)=\" \"),RIGHT(D517,LEN(D517)-4),D517)","v":"Großmutter"},"die Großmutter",null,null,"grandmother",null,null,{"$f":"RAND()","v":0.3421275385454564},{"$f":"IF(Table24[[#This Row],[Type Here]]=\"\",\"\",IF(Table24[[#This Row],[Type Here]]=Table24[[#This Row],[Answer]],1,-2))","v":""},{"$f":"IF($K$1=1,Table24[[#This Row],[Strength1]],Table24[[#This Row],[Strength2]])","v":0},{"$f":"IF($K$1=1,D517,G517)","v":"grandmother"},null,{"$f":"IF($K$1=1,IF(E517=\"\",\"\",E517),IF(H517=\"\",\"\",H517))","v":""},{"$f":"IF($K$1=1,G517,D517)","v":"die Großmutter"}]
[null,"02-Basics 2",{"$f":"IF(AND(LEFT(D518,1)=\"d\",MID(D518,4,1)=\" \"),RIGHT(D518,LEN(D518)-4),D518)","v":"sie trinken"},"sie trinken",null,0,"they drink",null,0,{"$f":"RAND()","v":0.1654496949003046},{"$f":"IF(Table24[[#This Row],[Type Here]]=\"\",\"\",IF(Table24[[#This Row],[Type Here]]=Table24[[#This Row],[Answer]],1,-2))","v":""},{"$f":"IF($K$1=1,Table24[[#This Row],[Strength1]],Table24[[#This Row],[Strength2]])","v":0},{"$f":"IF($K$1=1,D518,G518)","v":"they drink"},null,{"$f":"IF($K$1=1,IF(E518=\"\",\"\",E518),IF(H518=\"\",\"\",H518))","v":""},{"$f":"IF($K$1=1,G518,D518)","v":"sie trinken"}]
[null,"11-Family",{"$f":"IF(AND(LEFT(D519,1)=\"d\",MID(D519,4,1)=\" \"),RIGHT(D519,LEN(D519)-4),D519)","v":"Großeltern"},"die Großeltern",null,null,"grandparents",null,null,{"$f":"RAND()","v":0.209816142393622},{"$f":"IF(Table24[[#This Row],[Type Here]]=\"\",\"\",IF(Table24[[#This Row],[Type Here]]=Table24[[#This Row],[Answer]],1,-2))","v":""},{"$f":"IF($K$1=1,Table24[[#This Row],[Strength1]],Table24[[#This Row],[Strength2]])","v":0},{"$f":"IF($K$1=1,D519,G519)","v":"grandparents"},null,{"$f":"IF($K$1=1,IF(E519=\"\",\"\",E519),IF(H519=\"\",\"\",H519))","v":""},{"$f":"IF($K$1=1,G519,D519)","v":"die Großeltern"}]
[null,"33-Adverbs 1",{"$f":"IF(AND(LEFT(D520,1)=\"d\",MID(D520,4,1)=\" \"),RIGHT(D520,LEN(D520)-4),D520)","v":"zuerst"},"zuerst",null,0,"first","(position)",0,{"$f":"RAND()","v":0.6788770937426866},{"$f":"IF(Table24[[#This Row],[Type Here]]=\"\",\"\",IF(Table24[[#This Row],[Type Here]]=Table24[[#This Row],[Answer]],1,-2))","v":""},{"$f":"IF($K$1=1,Table24[[#This Row],[Strength1]],Table24[[#This Row],[Strength2]])","v":0},{"$f":"IF($K$1=1,D520,G520)","v":"first"},null,{"$f":"IF($K$1=1,IF(E520=\"\",\"\",E520),IF(H520=\"\",\"\",H520))","v":"(position)"},{"$f":"IF($K$1=1,G520,D520)","v":"zuerst"}]
[null,"40-Places",{"$f":"IF(AND(LEFT(D521,1)=\"d\",MID(D521,4,1)=\" \"),RIGHT(D521,LEN(D521)-4),D521)","v":"Flughäfen"},"die Flughäfen",null,0,"airports",null,1,{"$f":"RAND()","v":0.33244047278074307},{"$f":"IF(Table24[[#This Row],[Type Here]]=\"\",\"\",IF(Table24[[#This Row],[Type Here]]=Table24[[#This Row],[Answer]],1,-2))","v":""},{"$f":"IF($K$1=1,Table24[[#This Row],[Strength1]],Table24[[#This Row],[Strength2]])","v":1},{"$f":"IF($K$1=1,D521,G521)","v":"airports"},null,{"$f":"IF($K$1=1,IF(E521=\"\",\"\",E521),IF(H521=\"\",\"\",H521))","v":""},{"$f":"IF($K$1=1,G521,D521)","v":"die Flughäfen"}]
[null,"36-Nature",{"$f":"IF(AND(LEFT(D522,1)=\"d\",MID(D522,4,1)=\" \"),RIGHT(D522,LEN(D522)-4),D522)","v":"Luft"},"die Luft",null,0,"air",null,6,{"$f":"RAND()","v":0.2768252667862141},{"$f":"IF(Table24[[#This Row],[Type Here]]=\"\",\"\",IF(Table24[[#This Row],[Type Here]]=Table24[[#This Row],[Answer]],1,-2))","v":""},{"$f":"IF($K$1=1,Table24[[#This Row],[Strength1]],Table24[[#This Row],[Strength2]])","v":6},{"$f":"IF($K$1=1,D522,G522)","v":"air"},null,{"$f":"IF($K$1=1,IF(E522=\"\",\"\",E522),IF(H522=\"\",\"\",H522))","v":""},{"$f":"IF($K$1=1,G522,D522)","v":"die Luft"}]
[null,"04-Food",{"$f":"IF(AND(LEFT(D523,1)=\"d\",MID(D523,4,1)=\" \"),RIGHT(D523,LEN(D523)-4),D523)","v":"Kartoffel"},"die Kartoffel",null,0,"potato",null,3,{"$f":"RAND()","v":0.6880817904399539},{"$f":"IF(Table24[[#This Row],[Type Here]]=\"\",\"\",IF(Table24[[#This Row],[Type Here]]=Table24[[#This Row],[Answer]],1,-2))","v":""},{"$f":"IF($K$1=1,Table24[[#This Row],[Strength1]],Table24[[#This Row],[Strength2]])","v":3},{"$f":"IF($K$1=1,D523,G523)","v":"potato"},null,{"$f":"IF($K$1=1,IF(E523=\"\",\"\",E523),IF(H523=\"\",\"\",H523))","v":""},{"$f":"IF($K$1=1,G523,D523)","v":"die Kartoffel"}]
[null,"33-Adverbs 1",{"$f":"IF(AND(LEFT(D524,1)=\"d\",MID(D524,4,1)=\" \"),RIGHT(D524,LEN(D524)-4),D524)","v":"innen"},"innen",null,0,"on the inside",null,0,{"$f":"RAND()","v":0.35206276089447},{"$f":"IF(Table24[[#This Row],[Type Here]]=\"\",\"\",IF(Table24[[#This Row],[Type Here]]=Table24[[#This Row],[Answer]],1,-2))","v":""},{"$f":"IF($K$1=1,Table24[[#This Row],[Strength1]],Table24[[#This Row],[Strength2]])","v":0},{"$f":"IF($K$1=1,D524,G524)","v":"on the inside"},null,{"$f":"IF($K$1=1,IF(E524=\"\",\"\",E524),IF(H524=\"\",\"\",H524))","v":""},{"$f":"IF($K$1=1,G524,D524)","v":"innen"}]
[null,"29-Medical",{"$f":"IF(AND(LEFT(D525,1)=\"d\",MID(D525,4,1)=\" \"),RIGHT(D525,LEN(D525)-4),D525)","v":"Haar"},"das Haar",null,0,"hair","singular",4,{"$f":"RAND()","v":0.5146749681271177},{"$f":"IF(Table24[[#This Row],[Type Here]]=\"\",\"\",IF(Table24[[#This Row],[Type Here]]=Table24[[#This Row],[Answer]],1,-2))","v":""},{"$f":"IF($K$1=1,Table24[[#This Row],[Strength1]],Table24[[#This Row],[Strength2]])","v":4},{"$f":"IF($K$1=1,D525,G525)","v":"hair"},null,{"$f":"IF($K$1=1,IF(E525=\"\",\"\",E525),IF(H525=\"\",\"\",H525))","v":"singular"},{"$f":"IF($K$1=1,G525,D525)","v":"das Haar"}]
[null,"40-Places",{"$f":"IF(AND(LEFT(D526,1)=\"d\",MID(D526,4,1)=\" \"),RIGHT(D526,LEN(D526)-4),D526)","v":"Bezirk"},"der Bezirk",null,0,"district","(precinct, borough)",-2,{"$f":"RAND()","v":0.6086475507244781},{"$f":"IF(Table24[[#This Row],[Type Here]]=\"\",\"\",IF(Table24[[#This Row],[Type Here]]=Table24[[#This Row],[Answer]],1,-2))","v":""},{"$f":"IF($K$1=1,Table24[[#This Row],[Strength1]],Table24[[#This Row],[Strength2]])","v":-2},{"$f":"IF($K$1=1,D526,G526)","v":"district"},null,{"$f":"IF($K$1=1,IF(E526=\"\",\"\",E526),IF(H526=\"\",\"\",H526))","v":"(precinct, borough)"},{"$f":"IF($K$1=1,G526,D526)","v":"der Bezirk"}]
[null,"38-Ad: Nom. 1",{"$f":"IF(AND(LEFT(D527,1)=\"d\",MID(D527,4,1)=\" \"),RIGHT(D527,LEN(D527)-4),D527)","v":"speziell"},"speziell",null,0,"special","(purpose-made, custom built)",3,{"$f":"RAND()","v":0.5932402680295182},{"$f":"IF(Table24[[#This Row],[Type Here]]=\"\",\"\",IF(Table24[[#This Row],[Type Here]]=Table24[[#This Row],[Answer]],1,-2))","v":""},{"$f":"IF($K$1=1,Table24[[#This Row],[Strength1]],Table24[[#This Row],[Strength2]])","v":3},{"$f":"IF($K$1=1,D527,G527)","v":"special"},null,{"$f":"IF($K$1=1,IF(E527=\"\",\"\",E527),IF(H527=\"\",\"\",H527))","v":"(purpose-made, custom built)"},{"$f":"IF($K$1=1,G527,D527)","v":"speziell"}]
[null,"20-People",{"$f":"IF(AND(LEFT(D528,1)=\"d\",MID(D528,4,1)=\" \"),RIGHT(D528,LEN(D528)-4),D528)","v":"Leute"},"die Leute",null,0,"people","informal, general reference",0,{"$f":"RAND()","v":0.7732298637692165},{"$f":"IF(Table24[[#This Row],[Type Here]]=\"\",\"\",IF(Table24[[#This Row],[Type Here]]=Table24[[#This Row],[Answer]],1,-2))","v":""},{"$f":"IF($K$1=1,Table24[[#This Row],[Strength1]],Table24[[#This Row],[Strength2]])","v":0},{"$f":"IF($K$1=1,D528,G528)","v":"people"},null,{"$f":"IF($K$1=1,IF(E528=\"\",\"\",E528),IF(H528=\"\",\"\",H528))","v":"informal, general reference"},{"$f":"IF($K$1=1,G528,D528)","v":"die Leute"}]
[null,"09-Clothing",{"$f":"IF(AND(LEFT(D529,1)=\"d\",MID(D529,4,1)=\" \"),RIGHT(D529,LEN(D529)-4),D529)","v":"Mäntel"},"die Mäntel",null,0,"coats",null,-1,{"$f":"RAND()","v":0.40572937045025004},{"$f":"IF(Table24[[#This Row],[Type Here]]=\"\",\"\",IF(Table24[[#This Row],[Type Here]]=Table24[[#This Row],[Answer]],1,-2))","v":""},{"$f":"IF($K$1=1,Table24[[#This Row],[Strength1]],Table24[[#This Row],[Strength2]])","v":-1},{"$f":"IF($K$1=1,D529,G529)","v":"coats"},null,{"$f":"IF($K$1=1,IF(E529=\"\",\"\",E529),IF(H529=\"\",\"\",H529))","v":""},{"$f":"IF($K$1=1,G529,D529)","v":"die Mäntel"}]
[null,"06-Plurals",{"$f":"IF(AND(LEFT(D530,1)=\"d\",MID(D530,4,1)=\" \"),RIGHT(D530,LEN(D530)-4),D530)","v":"Menschen"},"die Menschen",null,0,"people","more formal, individual human beings",1,{"$f":"RAND()","v":0.24145722644283696},{"$f":"IF(Table24[[#This Row],[Type Here]]=\"\",\"\",IF(Table24[[#This Row],[Type Here]]=Table24[[#This Row],[Answer]],1,-2))","v":""},{"$f":"IF($K$1=1,Table24[[#This Row],[Strength1]],Table24[[#This Row],[Strength2]])","v":1},{"$f":"IF($K$1=1,D530,G530)","v":"people"},null,{"$f":"IF($K$1=1,IF(E530=\"\",\"\",E530),IF(H530=\"\",\"\",H530))","v":"more formal, individual human beings"},{"$f":"IF($K$1=1,G530,D530)","v":"die Menschen"}]
[null,"33-Adverbs 1",{"$f":"IF(AND(LEFT(D531,1)=\"d\",MID(D531,4,1)=\" \"),RIGHT(D531,LEN(D531)-4),D531)","v":"durchaus"},"durchaus",null,0,"absolutely",null,0,{"$f":"RAND()","v":0.9435341113743035},{"$f":"IF(Table24[[#This Row],[Type Here]]=\"\",\"\",IF(Table24[[#This Row],[Type Here]]=Table24[[#This Row],[Answer]],1,-2))","v":""},{"$f":"IF($K$1=1,Table24[[#This Row],[Strength1]],Table24[[#This Row],[Strength2]])","v":0},{"$f":"IF($K$1=1,D531,G531)","v":"absolutely"},null,{"$f":"IF($K$1=1,IF(E531=\"\",\"\",E531),IF(H531=\"\",\"\",H531))","v":""},{"$f":"IF($K$1=1,G531,D531)","v":"durchaus"}]
[null,"12-Acc. Pron.",{"$f":"IF(AND(LEFT(D532,1)=\"d\",MID(D532,4,1)=\" \"),RIGHT(D532,LEN(D532)-4),D532)","v":"mein"},"mein","acc pronoun",null,"my","acc pronoun",null,{"$f":"RAND()","v":0.5864479051213692},{"$f":"IF(Table24[[#This Row],[Type Here]]=\"\",\"\",IF(Table24[[#This Row],[Type Here]]=Table24[[#This Row],[Answer]],1,-2))","v":""},{"$f":"IF($K$1=1,Table24[[#This Row],[Strength1]],Table24[[#This Row],[Strength2]])","v":0},{"$f":"IF($K$1=1,D532,G532)","v":"my"},null,{"$f":"IF($K$1=1,IF(E532=\"\",\"\",E532),IF(H532=\"\",\"\",H532))","v":"acc pronoun"},{"$f":"IF($K$1=1,G532,D532)","v":"mein"}]
[null,"01-Basics 1",{"$f":"IF(AND(LEFT(D533,1)=\"d\",MID(D533,4,1)=\" \"),RIGHT(D533,LEN(D533)-4),D533)","v":"ich esse"},"ich esse",null,0,"I eat",null,1,{"$f":"RAND()","v":0.042680449498861184},{"$f":"IF(Table24[[#This Row],[Type Here]]=\"\",\"\",IF(Table24[[#This Row],[Type Here]]=Table24[[#This Row],[Answer]],1,-2))","v":""},{"$f":"IF($K$1=1,Table24[[#This Row],[Strength1]],Table24[[#This Row],[Strength2]])","v":1},{"$f":"IF($K$1=1,D533,G533)","v":"I eat"},null,{"$f":"IF($K$1=1,IF(E533=\"\",\"\",E533),IF(H533=\"\",\"\",H533))","v":""},{"$f":"IF($K$1=1,G533,D533)","v":"ich esse"}]
[null,"36-Nature",{"$f":"IF(AND(LEFT(D534,1)=\"d\",MID(D534,4,1)=\" \"),RIGHT(D534,LEN(D534)-4),D534)","v":"Gräser"},"die Gräser",null,0,"grasses",null,6,{"$f":"RAND()","v":0.506836171055684},{"$f":"IF(Table24[[#This Row],[Type Here]]=\"\",\"\",IF(Table24[[#This Row],[Type Here]]=Table24[[#This Row],[Answer]],1,-2))","v":""},{"$f":"IF($K$1=1,Table24[[#This Row],[Strength1]],Table24[[#This Row],[Strength2]])","v":6},{"$f":"IF($K$1=1,D534,G534)","v":"grasses"},null,{"$f":"IF($K$1=1,IF(E534=\"\",\"\",E534),IF(H534=\"\",\"\",H534))","v":""},{"$f":"IF($K$1=1,G534,D534)","v":"die Gräser"}]
[null,"05-Animals",{"$f":"IF(AND(LEFT(D535,1)=\"d\",MID(D535,4,1)=\" \"),RIGHT(D535,LEN(D535)-4),D535)","v":"Kuh"},"die Kuh",null,0,"cow",null,0,{"$f":"RAND()","v":0.4064011136121418},{"$f":"IF(Table24[[#This Row],[Type Here]]=\"\",\"\",IF(Table24[[#This Row],[Type Here]]=Table24[[#This Row],[Answer]],1,-2))","v":""},{"$f":"IF($K$1=1,Table24[[#This Row],[Strength1]],Table24[[#This Row],[Strength2]])","v":0},{"$f":"IF($K$1=1,D535,G535)","v":"cow"},null,{"$f":"IF($K$1=1,IF(E535=\"\",\"\",E535),IF(H535=\"\",\"\",H535))","v":""},{"$f":"IF($K$1=1,G535,D535)","v":"die Kuh"}]
[null,"14-Household",{"$f":"IF(AND(LEFT(D536,1)=\"d\",MID(D536,4,1)=\" \"),RIGHT(D536,LEN(D536)-4),D536)","v":"Teller"},"der Teller",null,0,"plate",null,1,{"$f":"RAND()","v":0.5277414800736053},{"$f":"IF(Table24[[#This Row],[Type Here]]=\"\",\"\",IF(Table24[[#This Row],[Type Here]]=Table24[[#This Row],[Answer]],1,-2))","v":""},{"$f":"IF($K$1=1,Table24[[#This Row],[Strength1]],Table24[[#This Row],[Strength2]])","v":1},{"$f":"IF($K$1=1,D536,G536)","v":"plate"},null,{"$f":"IF($K$1=1,IF(E536=\"\",\"\",E536),IF(H536=\"\",\"\",H536))","v":""},{"$f":"IF($K$1=1,G536,D536)","v":"der Teller"}]
[null,"01-Basics 1",{"$f":"IF(AND(LEFT(D537,1)=\"d\",MID(D537,4,1)=\" \"),RIGHT(D537,LEN(D537)-4),D537)","v":"ich"},"ich",null,0,"I",null,1,{"$f":"RAND()","v":0.27791274856560033},{"$f":"IF(Table24[[#This Row],[Type Here]]=\"\",\"\",IF(Table24[[#This Row],[Type Here]]=Table24[[#This Row],[Answer]],1,-2))","v":""},{"$f":"IF($K$1=1,Table24[[#This Row],[Strength1]],Table24[[#This Row],[Strength2]])","v":1},{"$f":"IF($K$1=1,D537,G537)","v":"I"},null,{"$f":"IF($K$1=1,IF(E537=\"\",\"\",E537),IF(H537=\"\",\"\",H537))","v":""},{"$f":"IF($K$1=1,G537,D537)","v":"ich"}]
[null,"10-Nom. Pron.",{"$f":"IF(AND(LEFT(D538,1)=\"d\",MID(D538,4,1)=\" \"),RIGHT(D538,LEN(D538)-4),D538)","v":"euer"},"euer",null,0,"your","familiar plural",-1,{"$f":"RAND()","v":0.4852939019627883},{"$f":"IF(Table24[[#This Row],[Type Here]]=\"\",\"\",IF(Table24[[#This Row],[Type Here]]=Table24[[#This Row],[Answer]],1,-2))","v":""},{"$f":"IF($K$1=1,Table24[[#This Row],[Strength1]],Table24[[#This Row],[Strength2]])","v":-1},{"$f":"IF($K$1=1,D538,G538)","v":"your"},null,{"$f":"IF($K$1=1,IF(E538=\"\",\"\",E538),IF(H538=\"\",\"\",H538))","v":"familiar plural"},{"$f":"IF($K$1=1,G538,D538)","v":"euer"}]
[null,"01-Basics 1",{"$f":"IF(AND(LEFT(D539,1)=\"d\",MID(D539,4,1)=\" \"),RIGHT(D539,LEN(D539)-4),D539)","v":"Wasser"},"die Wasser","(plural)",0,"waters","(noun)",0,{"$f":"RAND()","v":0.5975550101125734},{"$f":"IF(Table24[[#This Row],[Type Here]]=\"\",\"\",IF(Table24[[#This Row],[Type Here]]=Table24[[#This Row],[Answer]],1,-2))","v":""},{"$f":"IF($K$1=1,Table24[[#This Row],[Strength1]],Table24[[#This Row],[Strength2]])","v":0},{"$f":"IF($K$1=1,D539,G539)","v":"waters"},null,{"$f":"IF($K$1=1,IF(E539=\"\",\"\",E539),IF(H539=\"\",\"\",H539))","v":"(noun)"},{"$f":"IF($K$1=1,G539,D539)","v":"die Wasser"}]
[null,"09-Clothing",{"$f":"IF(AND(LEFT(D540,1)=\"d\",MID(D540,4,1)=\" \"),RIGHT(D540,LEN(D540)-4),D540)","v":"tragen"},"tragen",null,0,"to wear","to carry",1,{"$f":"RAND()","v":0.450228565086637},{"$f":"IF(Table24[[#This Row],[Type Here]]=\"\",\"\",IF(Table24[[#This Row],[Type Here]]=Table24[[#This Row],[Answer]],1,-2))","v":""},{"$f":"IF($K$1=1,Table24[[#This Row],[Strength1]],Table24[[#This Row],[Strength2]])","v":1},{"$f":"IF($K$1=1,D540,G540)","v":"to wear"},null,{"$f":"IF($K$1=1,IF(E540=\"\",\"\",E540),IF(H540=\"\",\"\",H540))","v":"to carry"},{"$f":"IF($K$1=1,G540,D540)","v":"tragen"}]
[null,"04-Food",{"$f":"IF(AND(LEFT(D541,1)=\"d\",MID(D541,4,1)=\" \"),RIGHT(D541,LEN(D541)-4),D541)","v":"Frühstück"},"das Frühstück",null,0,"breakfast",null,3,{"$f":"RAND()","v":0.7082897182310379},{"$f":"IF(Table24[[#This Row],[Type Here]]=\"\",\"\",IF(Table24[[#This Row],[Type Here]]=Table24[[#This Row],[Answer]],1,-2))","v":""},{"$f":"IF($K$1=1,Table24[[#This Row],[Strength1]],Table24[[#This Row],[Strength2]])","v":3},{"$f":"IF($K$1=1,D541,G541)","v":"breakfast"},null,{"$f":"IF($K$1=1,IF(E541=\"\",\"\",E541),IF(H541=\"\",\"\",H541))","v":""},{"$f":"IF($K$1=1,G541,D541)","v":"das Frühstück"}]
[null,"33-Adverbs 1",{"$f":"IF(AND(LEFT(D542,1)=\"d\",MID(D542,4,1)=\" \"),RIGHT(D542,LEN(D542)-4),D542)","v":"überhaupt"},"überhaupt",null,0,"at all",null,0,{"$f":"RAND()","v":0.6761316641072713},{"$f":"IF(Table24[[#This Row],[Type Here]]=\"\",\"\",IF(Table24[[#This Row],[Type Here]]=Table24[[#This Row],[Answer]],1,-2))","v":""},{"$f":"IF($K$1=1,Table24[[#This Row],[Strength1]],Table24[[#This Row],[Strength2]])","v":0},{"$f":"IF($K$1=1,D542,G542)","v":"at all"},null,{"$f":"IF($K$1=1,IF(E542=\"\",\"\",E542),IF(H542=\"\",\"\",H542))","v":""},{"$f":"IF($K$1=1,G542,D542)","v":"überhaupt"}]
[null,"09-Clothing",{"$f":"IF(AND(LEFT(D543,1)=\"d\",MID(D543,4,1)=\" \"),RIGHT(D543,LEN(D543)-4),D543)","v":"Hosen"},"die Hosen",null,0,"pants","plural",1,{"$f":"RAND()","v":0.7691385885336205},{"$f":"IF(Table24[[#This Row],[Type Here]]=\"\",\"\",IF(Table24[[#This Row],[Type Here]]=Table24[[#This Row],[Answer]],1,-2))","v":""},{"$f":"IF($K$1=1,Table24[[#This Row],[Strength1]],Table24[[#This Row],[Strength2]])","v":1},{"$f":"IF($K$1=1,D543,G543)","v":"pants"},null,{"$f":"IF($K$1=1,IF(E543=\"\",\"\",E543),IF(H543=\"\",\"\",H543))","v":"plural"},{"$f":"IF($K$1=1,G543,D543)","v":"die Hosen"}]
[null,"38-Ad: Nom. 1",{"$f":"IF(AND(LEFT(D544,1)=\"d\",MID(D544,4,1)=\" \"),RIGHT(D544,LEN(D544)-4),D544)","v":"zusätzlich"},"zusätzlich",null,0,"additional",null,3,{"$f":"RAND()","v":0.4740229841052034},{"$f":"IF(Table24[[#This Row],[Type Here]]=\"\",\"\",IF(Table24[[#This Row],[Type Here]]=Table24[[#This Row],[Answer]],1,-2))","v":""},{"$f":"IF($K$1=1,Table24[[#This Row],[Strength1]],Table24[[#This Row],[Strength2]])","v":3},{"$f":"IF($K$1=1,D544,G544)","v":"additional"},null,{"$f":"IF($K$1=1,IF(E544=\"\",\"\",E544),IF(H544=\"\",\"\",H544))","v":""},{"$f":"IF($K$1=1,G544,D544)","v":"zusätzlich"}]
[null,"40-Places",{"$f":"IF(AND(LEFT(D545,1)=\"d\",MID(D545,4,1)=\" \"),RIGHT(D545,LEN(D545)-4),D545)","v":"Hof"},"der Hof",null,0,"courtyard",null,0,{"$f":"RAND()","v":0.8441278230416304},{"$f":"IF(Table24[[#This Row],[Type Here]]=\"\",\"\",IF(Table24[[#This Row],[Type Here]]=Table24[[#This Row],[Answer]],1,-2))","v":""},{"$f":"IF($K$1=1,Table24[[#This Row],[Strength1]],Table24[[#This Row],[Strength2]])","v":0},{"$f":"IF($K$1=1,D545,G545)","v":"courtyard"},null,{"$f":"IF($K$1=1,IF(E545=\"\",\"\",E545),IF(H545=\"\",\"\",H545))","v":""},{"$f":"IF($K$1=1,G545,D545)","v":"der Hof"}]
[null,"10-Nom. Pron.",{"$f":"IF(AND(LEFT(D546,1)=\"d\",MID(D546,4,1)=\" \"),RIGHT(D546,LEN(D546)-4),D546)","v":"mein"},"mein",null,0,"mine",null,1,{"$f":"RAND()","v":0.5099112535321066},{"$f":"IF(Table24[[#This Row],[Type Here]]=\"\",\"\",IF(Table24[[#This Row],[Type Here]]=Table24[[#This Row],[Answer]],1,-2))","v":""},{"$f":"IF($K$1=1,Table24[[#This Row],[Strength1]],Table24[[#This Row],[Strength2]])","v":1},{"$f":"IF($K$1=1,D546,G546)","v":"mine"},null,{"$f":"IF($K$1=1,IF(E546=\"\",\"\",E546),IF(H546=\"\",\"\",H546))","v":""},{"$f":"IF($K$1=1,G546,D546)","v":"mein"}]
[null,"36-Nature",{"$f":"IF(AND(LEFT(D547,1)=\"d\",MID(D547,4,1)=\" \"),RIGHT(D547,LEN(D547)-4),D547)","v":"Strom"},"der Strom","(current, flow)",0,"stream","noun",6,{"$f":"RAND()","v":0.866916022791375},{"$f":"IF(Table24[[#This Row],[Type Here]]=\"\",\"\",IF(Table24[[#This Row],[Type Here]]=Table24[[#This Row],[Answer]],1,-2))","v":""},{"$f":"IF($K$1=1,Table24[[#This Row],[Strength1]],Table24[[#This Row],[Strength2]])","v":6},{"$f":"IF($K$1=1,D547,G547)","v":"stream"},null,{"$f":"IF($K$1=1,IF(E547=\"\",\"\",E547),IF(H547=\"\",\"\",H547))","v":"noun"},{"$f":"IF($K$1=1,G547,D547)","v":"der Strom"}]
[null,"04-Food",{"$f":"IF(AND(LEFT(D548,1)=\"d\",MID(D548,4,1)=\" \"),RIGHT(D548,LEN(D548)-4),D548)","v":"Vegetarier"},"die Vegetarier",null,0,"vegetarians","male plural",0,{"$f":"RAND()","v":0.7001469372750835},{"$f":"IF(Table24[[#This Row],[Type Here]]=\"\",\"\",IF(Table24[[#This Row],[Type Here]]=Table24[[#This Row],[Answer]],1,-2))","v":""},{"$f":"IF($K$1=1,Table24[[#This Row],[Strength1]],Table24[[#This Row],[Strength2]])","v":0},{"$f":"IF($K$1=1,D548,G548)","v":"vegetarians"},null,{"$f":"IF($K$1=1,IF(E548=\"\",\"\",E548),IF(H548=\"\",\"\",H548))","v":"male plural"},{"$f":"IF($K$1=1,G548,D548)","v":"die Vegetarier"}]
[null,"12-Acc. Pron.",{"$f":"IF(AND(LEFT(D549,1)=\"d\",MID(D549,4,1)=\" \"),RIGHT(D549,LEN(D549)-4),D549)","v":"dein"},"dein",null,null,"your","(singular familiar)",null,{"$f":"RAND()","v":0.6300721164485605},{"$f":"IF(Table24[[#This Row],[Type Here]]=\"\",\"\",IF(Table24[[#This Row],[Type Here]]=Table24[[#This Row],[Answer]],1,-2))","v":""},{"$f":"IF($K$1=1,Table24[[#This Row],[Strength1]],Table24[[#This Row],[Strength2]])","v":0},{"$f":"IF($K$1=1,D549,G549)","v":"your"},null,{"$f":"IF($K$1=1,IF(E549=\"\",\"\",E549),IF(H549=\"\",\"\",H549))","v":"(singular familiar)"},{"$f":"IF($K$1=1,G549,D549)","v":"dein"}]
[null,"36-Nature",{"$f":"IF(AND(LEFT(D550,1)=\"d\",MID(D550,4,1)=\" \"),RIGHT(D550,LEN(D550)-4),D550)","v":"Gärten"},"die Gärten",null,0,"gardens",null,6,{"$f":"RAND()","v":0.7720900710762595},{"$f":"IF(Table24[[#This Row],[Type Here]]=\"\",\"\",IF(Table24[[#This Row],[Type Here]]=Table24[[#This Row],[Answer]],1,-2))","v":""},{"$f":"IF($K$1=1,Table24[[#This Row],[Strength1]],Table24[[#This Row],[Strength2]])","v":6},{"$f":"IF($K$1=1,D550,G550)","v":"gardens"},null,{"$f":"IF($K$1=1,IF(E550=\"\",\"\",E550),IF(H550=\"\",\"\",H550))","v":""},{"$f":"IF($K$1=1,G550,D550)","v":"die Gärten"}]
[null,"33-Adverbs 1",{"$f":"IF(AND(LEFT(D551,1)=\"d\",MID(D551,4,1)=\" \"),RIGHT(D551,LEN(D551)-4),D551)","v":"danach"},"danach",null,0,"afterwards",null,0,{"$f":"RAND()","v":0.6966331945899541},{"$f":"IF(Table24[[#This Row],[Type Here]]=\"\",\"\",IF(Table24[[#This Row],[Type Here]]=Table24[[#This Row],[Answer]],1,-2))","v":""},{"$f":"IF($K$1=1,Table24[[#This Row],[Strength1]],Table24[[#This Row],[Strength2]])","v":0},{"$f":"IF($K$1=1,D551,G551)","v":"afterwards"},null,{"$f":"IF($K$1=1,IF(E551=\"\",\"\",E551),IF(H551=\"\",\"\",H551))","v":""},{"$f":"IF($K$1=1,G551,D551)","v":"danach"}]
[null,"36-Nature",{"$f":"IF(AND(LEFT(D552,1)=\"d\",MID(D552,4,1)=\" \"),RIGHT(D552,LEN(D552)-4),D552)","v":"Wald"},"der Wald",null,0,"forest",null,6,{"$f":"RAND()","v":0.3583318198123375},{"$f":"IF(Table24[[#This Row],[Type Here]]=\"\",\"\",IF(Table24[[#This Row],[Type Here]]=Table24[[#This Row],[Answer]],1,-2))","v":""},{"$f":"IF($K$1=1,Table24[[#This Row],[Strength1]],Table24[[#This Row],[Strength2]])","v":6},{"$f":"IF($K$1=1,D552,G552)","v":"forest"},null,{"$f":"IF($K$1=1,IF(E552=\"\",\"\",E552),IF(H552=\"\",\"\",H552))","v":""},{"$f":"IF($K$1=1,G552,D552)","v":"der Wald"}]
[null,"40-Places",{"$f":"IF(AND(LEFT(D553,1)=\"d\",MID(D553,4,1)=\" \"),RIGHT(D553,LEN(D553)-4),D553)","v":"Standorte"},"die Standorte",null,0,"positions","locations",-2,{"$f":"RAND()","v":0.8120214418165203},{"$f":"IF(Table24[[#This Row],[Type Here]]=\"\",\"\",IF(Table24[[#This Row],[Type Here]]=Table24[[#This Row],[Answer]],1,-2))","v":""},{"$f":"IF($K$1=1,Table24[[#This Row],[Strength1]],Table24[[#This Row],[Strength2]])","v":-2},{"$f":"IF($K$1=1,D553,G553)","v":"positions"},null,{"$f":"IF($K$1=1,IF(E553=\"\",\"\",E553),IF(H553=\"\",\"\",H553))","v":"locations"},{"$f":"IF($K$1=1,G553,D553)","v":"die Standorte"}]
[null,"06-Plurals",{"$f":"IF(AND(LEFT(D554,1)=\"d\",MID(D554,4,1)=\" \"),RIGHT(D554,LEN(D554)-4),D554)","v":"Tiere"},"die Tiere",null,0,"animals",null,1,{"$f":"RAND()","v":0.7217173215584535},{"$f":"IF(Table24[[#This Row],[Type Here]]=\"\",\"\",IF(Table24[[#This Row],[Type Here]]=Table24[[#This Row],[Answer]],1,-2))","v":""},{"$f":"IF($K$1=1,Table24[[#This Row],[Strength1]],Table24[[#This Row],[Strength2]])","v":1},{"$f":"IF($K$1=1,D554,G554)","v":"animals"},null,{"$f":"IF($K$1=1,IF(E554=\"\",\"\",E554),IF(H554=\"\",\"\",H554))","v":""},{"$f":"IF($K$1=1,G554,D554)","v":"die Tiere"}]
[null,"36-Nature",{"$f":"IF(AND(LEFT(D555,1)=\"d\",MID(D555,4,1)=\" \"),RIGHT(D555,LEN(D555)-4),D555)","v":"Stähle"},"die Stähle","(metals)",0,"steels","(metals)",6,{"$f":"RAND()","v":0.8009303324213062},{"$f":"IF(Table24[[#This Row],[Type Here]]=\"\",\"\",IF(Table24[[#This Row],[Type Here]]=Table24[[#This Row],[Answer]],1,-2))","v":""},{"$f":"IF($K$1=1,Table24[[#This Row],[Strength1]],Table24[[#This Row],[Strength2]])","v":6},{"$f":"IF($K$1=1,D555,G555)","v":"steels"},null,{"$f":"IF($K$1=1,IF(E555=\"\",\"\",E555),IF(H555=\"\",\"\",H555))","v":"(metals)"},{"$f":"IF($K$1=1,G555,D555)","v":"die Stähle"}]
[null,"09-Clothing",{"$f":"IF(AND(LEFT(D556,1)=\"d\",MID(D556,4,1)=\" \"),RIGHT(D556,LEN(D556)-4),D556)","v":"Knöpfe"},"die Knöpfe",null,0,"buttons",null,-1,{"$f":"RAND()","v":0.9256637013547813},{"$f":"IF(Table24[[#This Row],[Type Here]]=\"\",\"\",IF(Table24[[#This Row],[Type Here]]=Table24[[#This Row],[Answer]],1,-2))","v":""},{"$f":"IF($K$1=1,Table24[[#This Row],[Strength1]],Table24[[#This Row],[Strength2]])","v":-1},{"$f":"IF($K$1=1,D556,G556)","v":"buttons"},null,{"$f":"IF($K$1=1,IF(E556=\"\",\"\",E556),IF(H556=\"\",\"\",H556))","v":""},{"$f":"IF($K$1=1,G556,D556)","v":"die Knöpfe"}]
[null,"39-Adj: Acc.",{"$f":"IF(AND(LEFT(D557,1)=\"d\",MID(D557,4,1)=\" \"),RIGHT(D557,LEN(D557)-4),D557)","v":"vergangen"},"vergangen",null,0,"passed","(bygone)",8,{"$f":"RAND()","v":0.26995830207077876},{"$f":"IF(Table24[[#This Row],[Type Here]]=\"\",\"\",IF(Table24[[#This Row],[Type Here]]=Table24[[#This Row],[Answer]],1,-2))","v":""},{"$f":"IF($K$1=1,Table24[[#This Row],[Strength1]],Table24[[#This Row],[Strength2]])","v":8},{"$f":"IF($K$1=1,D557,G557)","v":"passed"},null,{"$f":"IF($K$1=1,IF(E557=\"\",\"\",E557),IF(H557=\"\",\"\",H557))","v":"(bygone)"},{"$f":"IF($K$1=1,G557,D557)","v":"vergangen"}]
[null,"14-Household",{"$f":"IF(AND(LEFT(D558,1)=\"d\",MID(D558,4,1)=\" \"),RIGHT(D558,LEN(D558)-4),D558)","v":"Bettbezug"},"das Bettbezug",null,0,"bedcover",null,-2,{"$f":"RAND()","v":0.360397909406993},{"$f":"IF(Table24[[#This Row],[Type Here]]=\"\",\"\",IF(Table24[[#This Row],[Type Here]]=Table24[[#This Row],[Answer]],1,-2))","v":""},{"$f":"IF($K$1=1,Table24[[#This Row],[Strength1]],Table24[[#This Row],[Strength2]])","v":-2},{"$f":"IF($K$1=1,D558,G558)","v":"bedcover"},null,{"$f":"IF($K$1=1,IF(E558=\"\",\"\",E558),IF(H558=\"\",\"\",H558))","v":""},{"$f":"IF($K$1=1,G558,D558)","v":"das Bettbezug"}]
[null,"02-Basics 2",{"$f":"IF(AND(LEFT(D559,1)=\"d\",MID(D559,4,1)=\" \"),RIGHT(D559,LEN(D559)-4),D559)","v":"ihr seid"},"ihr seid",null,0,"you are","informal plural",0,{"$f":"RAND()","v":0.28819133807669084},{"$f":"IF(Table24[[#This Row],[Type Here]]=\"\",\"\",IF(Table24[[#This Row],[Type Here]]=Table24[[#This Row],[Answer]],1,-2))","v":""},{"$f":"IF($K$1=1,Table24[[#This Row],[Strength1]],Table24[[#This Row],[Strength2]])","v":0},{"$f":"IF($K$1=1,D559,G559)","v":"you are"},null,{"$f":"IF($K$1=1,IF(E559=\"\",\"\",E559),IF(H559=\"\",\"\",H559))","v":"informal plural"},{"$f":"IF($K$1=1,G559,D559)","v":"ihr seid"}]
[null,"40-Places",{"$f":"IF(AND(LEFT(D560,1)=\"d\",MID(D560,4,1)=\" \"),RIGHT(D560,LEN(D560)-4),D560)","v":"Restaurants"},"die Restaurants",null,0,"restaurants",null,0,{"$f":"RAND()","v":0.5695104143922227},{"$f":"IF(Table24[[#This Row],[Type Here]]=\"\",\"\",IF(Table24[[#This Row],[Type Here]]=Table24[[#This Row],[Answer]],1,-2))","v":""},{"$f":"IF($K$1=1,Table24[[#This Row],[Strength1]],Table24[[#This Row],[Strength2]])","v":0},{"$f":"IF($K$1=1,D560,G560)","v":"restaurants"},null,{"$f":"IF($K$1=1,IF(E560=\"\",\"\",E560),IF(H560=\"\",\"\",H560))","v":""},{"$f":"IF($K$1=1,G560,D560)","v":"die Restaurants"}]
[null,"07-Adjectives",{"$f":"IF(AND(LEFT(D561,1)=\"d\",MID(D561,4,1)=\" \"),RIGHT(D561,LEN(D561)-4),D561)","v":"kostenlos"},"kostenlos",null,0,"free","(without cost)",3,{"$f":"RAND()","v":0.31995716829280607},{"$f":"IF(Table24[[#This Row],[Type Here]]=\"\",\"\",IF(Table24[[#This Row],[Type Here]]=Table24[[#This Row],[Answer]],1,-2))","v":""},{"$f":"IF($K$1=1,Table24[[#This Row],[Strength1]],Table24[[#This Row],[Strength2]])","v":3},{"$f":"IF($K$1=1,D561,G561)","v":"free"},null,{"$f":"IF($K$1=1,IF(E561=\"\",\"\",E561),IF(H561=\"\",\"\",H561))","v":"(without cost)"},{"$f":"IF($K$1=1,G561,D561)","v":"kostenlos"}]
[null,"39-Adj: Acc.",{"$f":"IF(AND(LEFT(D562,1)=\"d\",MID(D562,4,1)=\" \"),RIGHT(D562,LEN(D562)-4),D562)","v":"technisch"},"technisch",null,0,"technical",null,10,{"$f":"RAND()","v":0.915119903456442},{"$f":"IF(Table24[[#This Row],[Type Here]]=\"\",\"\",IF(Table24[[#This Row],[Type Here]]=Table24[[#This Row],[Answer]],1,-2))","v":""},{"$f":"IF($K$1=1,Table24[[#This Row],[Strength1]],Table24[[#This Row],[Strength2]])","v":10},{"$f":"IF($K$1=1,D562,G562)","v":"technical"},null,{"$f":"IF($K$1=1,IF(E562=\"\",\"\",E562),IF(H562=\"\",\"\",H562))","v":""},{"$f":"IF($K$1=1,G562,D562)","v":"technisch"}]
[null,"02-Basics 2",{"$f":"IF(AND(LEFT(D563,1)=\"d\",MID(D563,4,1)=\" \"),RIGHT(D563,LEN(D563)-4),D563)","v":"er hat"},"er hat",null,0,"he has",null,0,{"$f":"RAND()","v":0.8388204497180813},{"$f":"IF(Table24[[#This Row],[Type Here]]=\"\",\"\",IF(Table24[[#This Row],[Type Here]]=Table24[[#This Row],[Answer]],1,-2))","v":""},{"$f":"IF($K$1=1,Table24[[#This Row],[Strength1]],Table24[[#This Row],[Strength2]])","v":0},{"$f":"IF($K$1=1,D563,G563)","v":"he has"},null,{"$f":"IF($K$1=1,IF(E563=\"\",\"\",E563),IF(H563=\"\",\"\",H563))","v":""},{"$f":"IF($K$1=1,G563,D563)","v":"er hat"}]
[null,"22-Colors",{"$f":"IF(AND(LEFT(D564,1)=\"d\",MID(D564,4,1)=\" \"),RIGHT(D564,LEN(D564)-4),D564)","v":"blau"},"blau",null,0,"blue",null,1,{"$f":"RAND()","v":0.30654245867236285},{"$f":"IF(Table24[[#This Row],[Type Here]]=\"\",\"\",IF(Table24[[#This Row],[Type Here]]=Table24[[#This Row],[Answer]],1,-2))","v":""},{"$f":"IF($K$1=1,Table24[[#This Row],[Strength1]],Table24[[#This Row],[Strength2]])","v":1},{"$f":"IF($K$1=1,D564,G564)","v":"blue"},null,{"$f":"IF($K$1=1,IF(E564=\"\",\"\",E564),IF(H564=\"\",\"\",H564))","v":""},{"$f":"IF($K$1=1,G564,D564)","v":"blau"}]
[null,"40-Places",{"$f":"IF(AND(LEFT(D565,1)=\"d\",MID(D565,4,1)=\" \"),RIGHT(D565,LEN(D565)-4),D565)","v":"Norden"},"der Norden",null,0,"north",null,2,{"$f":"RAND()","v":0.3978752180171312},{"$f":"IF(Table24[[#This Row],[Type Here]]=\"\",\"\",IF(Table24[[#This Row],[Type Here]]=Table24[[#This Row],[Answer]],1,-2))","v":""},{"$f":"IF($K$1=1,Table24[[#This Row],[Strength1]],Table24[[#This Row],[Strength2]])","v":2},{"$f":"IF($K$1=1,D565,G565)","v":"north"},null,{"$f":"IF($K$1=1,IF(E565=\"\",\"\",E565),IF(H565=\"\",\"\",H565))","v":""},{"$f":"IF($K$1=1,G565,D565)","v":"der Norden"}]
[null,"36-Nature",{"$f":"IF(AND(LEFT(D566,1)=\"d\",MID(D566,4,1)=\" \"),RIGHT(D566,LEN(D566)-4),D566)","v":"Stern"},"der Stern",null,0,"star",null,6,{"$f":"RAND()","v":0.8643512585918017},{"$f":"IF(Table24[[#This Row],[Type Here]]=\"\",\"\",IF(Table24[[#This Row],[Type Here]]=Table24[[#This Row],[Answer]],1,-2))","v":""},{"$f":"IF($K$1=1,Table24[[#This Row],[Strength1]],Table24[[#This Row],[Strength2]])","v":6},{"$f":"IF($K$1=1,D566,G566)","v":"star"},null,{"$f":"IF($K$1=1,IF(E566=\"\",\"\",E566),IF(H566=\"\",\"\",H566))","v":""},{"$f":"IF($K$1=1,G566,D566)","v":"der Stern"}]
[null,"07-Adjectives",{"$f":"IF(AND(LEFT(D567,1)=\"d\",MID(D567,4,1)=\" \"),RIGHT(D567,LEN(D567)-4),D567)","v":"schön"},"schön",null,0,"pretty","beautiful, nice",0,{"$f":"RAND()","v":0.12614617932151895},{"$f":"IF(Table24[[#This Row],[Type Here]]=\"\",\"\",IF(Table24[[#This Row],[Type Here]]=Table24[[#This Row],[Answer]],1,-2))","v":""},{"$f":"IF($K$1=1,Table24[[#This Row],[Strength1]],Table24[[#This Row],[Strength2]])","v":0},{"$f":"IF($K$1=1,D567,G567)","v":"pretty"},null,{"$f":"IF($K$1=1,IF(E567=\"\",\"\",E567),IF(H567=\"\",\"\",H567))","v":"beautiful, nice"},{"$f":"IF($K$1=1,G567,D567)","v":"schön"}]
[null,"11-Family",{"$f":"IF(AND(LEFT(D568,1)=\"d\",MID(D568,4,1)=\" \"),RIGHT(D568,LEN(D568)-4),D568)","v":"Vater"},"der Vater",null,null,"father",null,null,{"$f":"RAND()","v":0.7515672701819013},{"$f":"IF(Table24[[#This Row],[Type Here]]=\"\",\"\",IF(Table24[[#This Row],[Type Here]]=Table24[[#This Row],[Answer]],1,-2))","v":""},{"$f":"IF($K$1=1,Table24[[#This Row],[Strength1]],Table24[[#This Row],[Strength2]])","v":0},{"$f":"IF($K$1=1,D568,G568)","v":"father"},null,{"$f":"IF($K$1=1,IF(E568=\"\",\"\",E568),IF(H568=\"\",\"\",H568))","v":""},{"$f":"IF($K$1=1,G568,D568)","v":"der Vater"}]
[null,"14-Household",{"$f":"IF(AND(LEFT(D569,1)=\"d\",MID(D569,4,1)=\" \"),RIGHT(D569,LEN(D569)-4),D569)","v":"Dach"},"das Dach",null,0,"roof",null,1,{"$f":"RAND()","v":0.186060064202066},{"$f":"IF(Table24[[#This Row],[Type Here]]=\"\",\"\",IF(Table24[[#This Row],[Type Here]]=Table24[[#This Row],[Answer]],1,-2))","v":""},{"$f":"IF($K$1=1,Table24[[#This Row],[Strength1]],Table24[[#This Row],[Strength2]])","v":1},{"$f":"IF($K$1=1,D569,G569)","v":"roof"},null,{"$f":"IF($K$1=1,IF(E569=\"\",\"\",E569),IF(H569=\"\",\"\",H569))","v":""},{"$f":"IF($K$1=1,G569,D569)","v":"das Dach"}]
[null,"08-V. Pres. 1",{"$f":"IF(AND(LEFT(D570,1)=\"d\",MID(D570,4,1)=\" \"),RIGHT(D570,LEN(D570)-4),D570)","v":"lesen"},"lesen",null,0,"to read",null,0,{"$f":"RAND()","v":0.036801029063692314},{"$f":"IF(Table24[[#This Row],[Type Here]]=\"\",\"\",IF(Table24[[#This Row],[Type Here]]=Table24[[#This Row],[Answer]],1,-2))","v":""},{"$f":"IF($K$1=1,Table24[[#This Row],[Strength1]],Table24[[#This Row],[Strength2]])","v":0},{"$f":"IF($K$1=1,D570,G570)","v":"to read"},null,{"$f":"IF($K$1=1,IF(E570=\"\",\"\",E570),IF(H570=\"\",\"\",H570))","v":""},{"$f":"IF($K$1=1,G570,D570)","v":"lesen"}]
[null,"29-Medical",{"$f":"IF(AND(LEFT(D571,1)=\"d\",MID(D571,4,1)=\" \"),RIGHT(D571,LEN(D571)-4),D571)","v":"Hälse"},"die Hälse",null,0,"necks","anatomy",4,{"$f":"RAND()","v":0.459777929505931},{"$f":"IF(Table24[[#This Row],[Type Here]]=\"\",\"\",IF(Table24[[#This Row],[Type Here]]=Table24[[#This Row],[Answer]],1,-2))","v":""},{"$f":"IF($K$1=1,Table24[[#This Row],[Strength1]],Table24[[#This Row],[Strength2]])","v":4},{"$f":"IF($K$1=1,D571,G571)","v":"necks"},null,{"$f":"IF($K$1=1,IF(E571=\"\",\"\",E571),IF(H571=\"\",\"\",H571))","v":"anatomy"},{"$f":"IF($K$1=1,G571,D571)","v":"die Hälse"}]
[null,"29-Medical",{"$f":"IF(AND(LEFT(D572,1)=\"d\",MID(D572,4,1)=\" \"),RIGHT(D572,LEN(D572)-4),D572)","v":"Geburten"},"die Geburten",null,0,"births",null,5,{"$f":"RAND()","v":0.5825705762179633},{"$f":"IF(Table24[[#This Row],[Type Here]]=\"\",\"\",IF(Table24[[#This Row],[Type Here]]=Table24[[#This Row],[Answer]],1,-2))","v":""},{"$f":"IF($K$1=1,Table24[[#This Row],[Strength1]],Table24[[#This Row],[Strength2]])","v":5},{"$f":"IF($K$1=1,D572,G572)","v":"births"},null,{"$f":"IF($K$1=1,IF(E572=\"\",\"\",E572),IF(H572=\"\",\"\",H572))","v":""},{"$f":"IF($K$1=1,G572,D572)","v":"die Geburten"}]
[null,"09-Clothing",{"$f":"IF(AND(LEFT(D573,1)=\"d\",MID(D573,4,1)=\" \"),RIGHT(D573,LEN(D573)-4),D573)","v":"Röcke"},"die Röcke",null,0,"skirts",null,1,{"$f":"RAND()","v":0.8944466688233079},{"$f":"IF(Table24[[#This Row],[Type Here]]=\"\",\"\",IF(Table24[[#This Row],[Type Here]]=Table24[[#This Row],[Answer]],1,-2))","v":""},{"$f":"IF($K$1=1,Table24[[#This Row],[Strength1]],Table24[[#This Row],[Strength2]])","v":1},{"$f":"IF($K$1=1,D573,G573)","v":"skirts"},null,{"$f":"IF($K$1=1,IF(E573=\"\",\"\",E573),IF(H573=\"\",\"\",H573))","v":""},{"$f":"IF($K$1=1,G573,D573)","v":"die Röcke"}]
[null,"14-Household",{"$f":"IF(AND(LEFT(D574,1)=\"d\",MID(D574,4,1)=\" \"),RIGHT(D574,LEN(D574)-4),D574)","v":"Dächer"},"die Dächer",null,0,"roofs",null,-2,{"$f":"RAND()","v":0.8519937645929987},{"$f":"IF(Table24[[#This Row],[Type Here]]=\"\",\"\",IF(Table24[[#This Row],[Type Here]]=Table24[[#This Row],[Answer]],1,-2))","v":""},{"$f":"IF($K$1=1,Table24[[#This Row],[Strength1]],Table24[[#This Row],[Strength2]])","v":-2},{"$f":"IF($K$1=1,D574,G574)","v":"roofs"},null,{"$f":"IF($K$1=1,IF(E574=\"\",\"\",E574),IF(H574=\"\",\"\",H574))","v":""},{"$f":"IF($K$1=1,G574,D574)","v":"die Dächer"}]
[null,"04-Food",{"$f":"IF(AND(LEFT(D575,1)=\"d\",MID(D575,4,1)=\" \"),RIGHT(D575,LEN(D575)-4),D575)","v":"Käse"},"die Käse",null,0,"cheeses",null,0,{"$f":"RAND()","v":0.3245216640697147},{"$f":"IF(Table24[[#This Row],[Type Here]]=\"\",\"\",IF(Table24[[#This Row],[Type Here]]=Table24[[#This Row],[Answer]],1,-2))","v":""},{"$f":"IF($K$1=1,Table24[[#This Row],[Strength1]],Table24[[#This Row],[Strength2]])","v":0},{"$f":"IF($K$1=1,D575,G575)","v":"cheeses"},null,{"$f":"IF($K$1=1,IF(E575=\"\",\"\",E575),IF(H575=\"\",\"\",H575))","v":""},{"$f":"IF($K$1=1,G575,D575)","v":"die Käse"}]
[null,"03-Phrases",{"$f":"IF(AND(LEFT(D576,1)=\"d\",MID(D576,4,1)=\" \"),RIGHT(D576,LEN(D576)-4),D576)","v":"bald"},"bald",null,0,"soon",null,2,{"$f":"RAND()","v":0.7591811970296874},{"$f":"IF(Table24[[#This Row],[Type Here]]=\"\",\"\",IF(Table24[[#This Row],[Type Here]]=Table24[[#This Row],[Answer]],1,-2))","v":""},{"$f":"IF($K$1=1,Table24[[#This Row],[Strength1]],Table24[[#This Row],[Strength2]])","v":2},{"$f":"IF($K$1=1,D576,G576)","v":"soon"},null,{"$f":"IF($K$1=1,IF(E576=\"\",\"\",E576),IF(H576=\"\",\"\",H576))","v":""},{"$f":"IF($K$1=1,G576,D576)","v":"bald"}]
[null,"04-Food",{"$f":"IF(AND(LEFT(D577,1)=\"d\",MID(D577,4,1)=\" \"),RIGHT(D577,LEN(D577)-4),D577)","v":"Ei"},"das Ei",null,0,"egg",null,1,{"$f":"RAND()","v":0.39982991603617013},{"$f":"IF(Table24[[#This Row],[Type Here]]=\"\",\"\",IF(Table24[[#This Row],[Type Here]]=Table24[[#This Row],[Answer]],1,-2))","v":""},{"$f":"IF($K$1=1,Table24[[#This Row],[Strength1]],Table24[[#This Row],[Strength2]])","v":1},{"$f":"IF($K$1=1,D577,G577)","v":"egg"},null,{"$f":"IF($K$1=1,IF(E577=\"\",\"\",E577),IF(H577=\"\",\"\",H577))","v":""},{"$f":"IF($K$1=1,G577,D577)","v":"das Ei"}]
[null,"33-Adverbs 1",{"$f":"IF(AND(LEFT(D578,1)=\"d\",MID(D578,4,1)=\" \"),RIGHT(D578,LEN(D578)-4),D578)","v":"dabei"},"dabei","(at the same time)",0,"with",null,-1,{"$f":"RAND()","v":0.148359835569829},{"$f":"IF(Table24[[#This Row],[Type Here]]=\"\",\"\",IF(Table24[[#This Row],[Type Here]]=Table24[[#This Row],[Answer]],1,-2))","v":""},{"$f":"IF($K$1=1,Table24[[#This Row],[Strength1]],Table24[[#This Row],[Strength2]])","v":-1},{"$f":"IF($K$1=1,D578,G578)","v":"with"},null,{"$f":"IF($K$1=1,IF(E578=\"\",\"\",E578),IF(H578=\"\",\"\",H578))","v":""},{"$f":"IF($K$1=1,G578,D578)","v":"dabei"}]
[null,"05-Animals",{"$f":"IF(AND(LEFT(D579,1)=\"d\",MID(D579,4,1)=\" \"),RIGHT(D579,LEN(D579)-4),D579)","v":"Haustier"},"das Haustier",null,0,"pet","noun",0,{"$f":"RAND()","v":0.8478127783368117},{"$f":"IF(Table24[[#This Row],[Type Here]]=\"\",\"\",IF(Table24[[#This Row],[Type Here]]=Table24[[#This Row],[Answer]],1,-2))","v":""},{"$f":"IF($K$1=1,Table24[[#This Row],[Strength1]],Table24[[#This Row],[Strength2]])","v":0},{"$f":"IF($K$1=1,D579,G579)","v":"pet"},null,{"$f":"IF($K$1=1,IF(E579=\"\",\"\",E579),IF(H579=\"\",\"\",H579))","v":"noun"},{"$f":"IF($K$1=1,G579,D579)","v":"das Haustier"}]
[null,"38-Ad: Nom. 1",{"$f":"IF(AND(LEFT(D580,1)=\"d\",MID(D580,4,1)=\" \"),RIGHT(D580,LEN(D580)-4),D580)","v":"weiter"},"weiter",null,0,"further","(additional, another)",3,{"$f":"RAND()","v":0.45834167326878916},{"$f":"IF(Table24[[#This Row],[Type Here]]=\"\",\"\",IF(Table24[[#This Row],[Type Here]]=Table24[[#This Row],[Answer]],1,-2))","v":""},{"$f":"IF($K$1=1,Table24[[#This Row],[Strength1]],Table24[[#This Row],[Strength2]])","v":3},{"$f":"IF($K$1=1,D580,G580)","v":"further"},null,{"$f":"IF($K$1=1,IF(E580=\"\",\"\",E580),IF(H580=\"\",\"\",H580))","v":"(additional, another)"},{"$f":"IF($K$1=1,G580,D580)","v":"weiter"}]
[null,"01-Basics 1",{"$f":"IF(AND(LEFT(D581,1)=\"d\",MID(D581,4,1)=\" \"),RIGHT(D581,LEN(D581)-4),D581)","v":"die"},"die","(article - Nom fem)",0,"the","Nom fem",0,{"$f":"RAND()","v":0.11067026646372369},{"$f":"IF(Table24[[#This Row],[Type Here]]=\"\",\"\",IF(Table24[[#This Row],[Type Here]]=Table24[[#This Row],[Answer]],1,-2))","v":""},{"$f":"IF($K$1=1,Table24[[#This Row],[Strength1]],Table24[[#This Row],[Strength2]])","v":0},{"$f":"IF($K$1=1,D581,G581)","v":"the"},null,{"$f":"IF($K$1=1,IF(E581=\"\",\"\",E581),IF(H581=\"\",\"\",H581))","v":"Nom fem"},{"$f":"IF($K$1=1,G581,D581)","v":"die"}]
[null,"02-Basics 2",{"$f":"IF(AND(LEFT(D582,1)=\"d\",MID(D582,4,1)=\" \"),RIGHT(D582,LEN(D582)-4),D582)","v":"Jungen"},"die Jungen",null,0,"boys",null,0,{"$f":"RAND()","v":0.8124985716243454},{"$f":"IF(Table24[[#This Row],[Type Here]]=\"\",\"\",IF(Table24[[#This Row],[Type Here]]=Table24[[#This Row],[Answer]],1,-2))","v":""},{"$f":"IF($K$1=1,Table24[[#This Row],[Strength1]],Table24[[#This Row],[Strength2]])","v":0},{"$f":"IF($K$1=1,D582,G582)","v":"boys"},null,{"$f":"IF($K$1=1,IF(E582=\"\",\"\",E582),IF(H582=\"\",\"\",H582))","v":""},{"$f":"IF($K$1=1,G582,D582)","v":"die Jungen"}]
[null,"01-Basics 1",{"$f":"IF(AND(LEFT(D583,1)=\"d\",MID(D583,4,1)=\" \"),RIGHT(D583,LEN(D583)-4),D583)","v":"du"},"du",null,0,"you","(singular familiar)",0,{"$f":"RAND()","v":0.5093066323535336},{"$f":"IF(Table24[[#This Row],[Type Here]]=\"\",\"\",IF(Table24[[#This Row],[Type Here]]=Table24[[#This Row],[Answer]],1,-2))","v":""},{"$f":"IF($K$1=1,Table24[[#This Row],[Strength1]],Table24[[#This Row],[Strength2]])","v":0},{"$f":"IF($K$1=1,D583,G583)","v":"you"},null,{"$f":"IF($K$1=1,IF(E583=\"\",\"\",E583),IF(H583=\"\",\"\",H583))","v":"(singular familiar)"},{"$f":"IF($K$1=1,G583,D583)","v":"du"}]
[null,"01-Basics 1",{"$f":"IF(AND(LEFT(D584,1)=\"d\",MID(D584,4,1)=\" \"),RIGHT(D584,LEN(D584)-4),D584)","v":"du bist"},"du bist",null,0,"you are","(singular familiar)",0,{"$f":"RAND()","v":0.7189962320551732},{"$f":"IF(Table24[[#This Row],[Type Here]]=\"\",\"\",IF(Table24[[#This Row],[Type Here]]=Table24[[#This Row],[Answer]],1,-2))","v":""},{"$f":"IF($K$1=1,Table24[[#This Row],[Strength1]],Table24[[#This Row],[Strength2]])","v":0},{"$f":"IF($K$1=1,D584,G584)","v":"you are"},null,{"$f":"IF($K$1=1,IF(E584=\"\",\"\",E584),IF(H584=\"\",\"\",H584))","v":"(singular familiar)"},{"$f":"IF($K$1=1,G584,D584)","v":"du bist"}]
[null,"04-Food",{"$f":"IF(AND(LEFT(D585,1)=\"d\",MID(D585,4,1)=\" \"),RIGHT(D585,LEN(D585)-4),D585)","v":"Speisekarte"},"die Speisekarte",null,0,"menu","bill of fair",3,{"$f":"RAND()","v":0.6016837574900571},{"$f":"IF(Table24[[#This Row],[Type Here]]=\"\",\"\",IF(Table24[[#This Row],[Type Here]]=Table24[[#This Row],[Answer]],1,-2))","v":""},{"$f":"IF($K$1=1,Table24[[#This Row],[Strength1]],Table24[[#This Row],[Strength2]])","v":3},{"$f":"IF($K$1=1,D585,G585)","v":"menu"},null,{"$f":"IF($K$1=1,IF(E585=\"\",\"\",E585),IF(H585=\"\",\"\",H585))","v":"bill of fair"},{"$f":"IF($K$1=1,G585,D585)","v":"die Speisekarte"}]
[null,"10-Nom. Pron.",{"$f":"IF(AND(LEFT(D586,1)=\"d\",MID(D586,4,1)=\" \"),RIGHT(D586,LEN(D586)-4),D586)","v":"alle"},"alle",null,0,"all",null,1,{"$f":"RAND()","v":0.9096372568790747},{"$f":"IF(Table24[[#This Row],[Type Here]]=\"\",\"\",IF(Table24[[#This Row],[Type Here]]=Table24[[#This Row],[Answer]],1,-2))","v":""},{"$f":"IF($K$1=1,Table24[[#This Row],[Strength1]],Table24[[#This Row],[Strength2]])","v":1},{"$f":"IF($K$1=1,D586,G586)","v":"all"},null,{"$f":"IF($K$1=1,IF(E586=\"\",\"\",E586),IF(H586=\"\",\"\",H586))","v":""},{"$f":"IF($K$1=1,G586,D586)","v":"alle"}]
[null,"33-Adverbs 1",{"$f":"IF(AND(LEFT(D587,1)=\"d\",MID(D587,4,1)=\" \"),RIGHT(D587,LEN(D587)-4),D587)","v":"außerdem"},"außerdem",null,0,"in addition",null,2,{"$f":"RAND()","v":0.43433511212052844},{"$f":"IF(Table24[[#This Row],[Type Here]]=\"\",\"\",IF(Table24[[#This Row],[Type Here]]=Table24[[#This Row],[Answer]],1,-2))","v":""},{"$f":"IF($K$1=1,Table24[[#This Row],[Strength1]],Table24[[#This Row],[Strength2]])","v":2},{"$f":"IF($K$1=1,D587,G587)","v":"in addition"},null,{"$f":"IF($K$1=1,IF(E587=\"\",\"\",E587),IF(H587=\"\",\"\",H587))","v":""},{"$f":"IF($K$1=1,G587,D587)","v":"außerdem"}]
[null,"36-Nature",{"$f":"IF(AND(LEFT(D588,1)=\"d\",MID(D588,4,1)=\" \"),RIGHT(D588,LEN(D588)-4),D588)","v":"Welten"},"die Welten",null,0,"worlds",null,6,{"$f":"RAND()","v":0.9742039246688899},{"$f":"IF(Table24[[#This Row],[Type Here]]=\"\",\"\",IF(Table24[[#This Row],[Type Here]]=Table24[[#This Row],[Answer]],1,-2))","v":""},{"$f":"IF($K$1=1,Table24[[#This Row],[Strength1]],Table24[[#This Row],[Strength2]])","v":6},{"$f":"IF($K$1=1,D588,G588)","v":"worlds"},null,{"$f":"IF($K$1=1,IF(E588=\"\",\"\",E588),IF(H588=\"\",\"\",H588))","v":""},{"$f":"IF($K$1=1,G588,D588)","v":"die Welten"}]
[null,"38-Ad: Nom. 1",{"$f":"IF(AND(LEFT(D589,1)=\"d\",MID(D589,4,1)=\" \"),RIGHT(D589,LEN(D589)-4),D589)","v":"wichtigst"},"wichtigst",null,0,"most important",null,3,{"$f":"RAND()","v":0.24922752689516392},{"$f":"IF(Table24[[#This Row],[Type Here]]=\"\",\"\",IF(Table24[[#This Row],[Type Here]]=Table24[[#This Row],[Answer]],1,-2))","v":""},{"$f":"IF($K$1=1,Table24[[#This Row],[Strength1]],Table24[[#This Row],[Strength2]])","v":3},{"$f":"IF($K$1=1,D589,G589)","v":"most important"},null,{"$f":"IF($K$1=1,IF(E589=\"\",\"\",E589),IF(H589=\"\",\"\",H589))","v":""},{"$f":"IF($K$1=1,G589,D589)","v":"wichtigst"}]
[null,"39-Adj: Acc.",{"$f":"IF(AND(LEFT(D590,1)=\"d\",MID(D590,4,1)=\" \"),RIGHT(D590,LEN(D590)-4),D590)","v":"komplett"},"komplett",null,0,"complete",null,11,{"$f":"RAND()","v":0.11645174359124022},{"$f":"IF(Table24[[#This Row],[Type Here]]=\"\",\"\",IF(Table24[[#This Row],[Type Here]]=Table24[[#This Row],[Answer]],1,-2))","v":""},{"$f":"IF($K$1=1,Table24[[#This Row],[Strength1]],Table24[[#This Row],[Strength2]])","v":11},{"$f":"IF($K$1=1,D590,G590)","v":"complete"},null,{"$f":"IF($K$1=1,IF(E590=\"\",\"\",E590),IF(H590=\"\",\"\",H590))","v":""},{"$f":"IF($K$1=1,G590,D590)","v":"komplett"}]
[null,"12-Acc. Pron.",{"$f":"IF(AND(LEFT(D591,1)=\"d\",MID(D591,4,1)=\" \"),RIGHT(D591,LEN(D591)-4),D591)","v":"ander"},"ander",null,null,"other","another",null,{"$f":"RAND()","v":0.47879607683887015},{"$f":"IF(Table24[[#This Row],[Type Here]]=\"\",\"\",IF(Table24[[#This Row],[Type Here]]=Table24[[#This Row],[Answer]],1,-2))","v":""},{"$f":"IF($K$1=1,Table24[[#This Row],[Strength1]],Table24[[#This Row],[Strength2]])","v":0},{"$f":"IF($K$1=1,D591,G591)","v":"other"},null,{"$f":"IF($K$1=1,IF(E591=\"\",\"\",E591),IF(H591=\"\",\"\",H591))","v":"another"},{"$f":"IF($K$1=1,G591,D591)","v":"ander"}]
[null,"04-Food",{"$f":"IF(AND(LEFT(D592,1)=\"d\",MID(D592,4,1)=\" \"),RIGHT(D592,LEN(D592)-4),D592)","v":"süß"},"süß",null,0,"sweet",null,3,{"$f":"RAND()","v":0.910810006690754},{"$f":"IF(Table24[[#This Row],[Type Here]]=\"\",\"\",IF(Table24[[#This Row],[Type Here]]=Table24[[#This Row],[Answer]],1,-2))","v":""},{"$f":"IF($K$1=1,Table24[[#This Row],[Strength1]],Table24[[#This Row],[Strength2]])","v":3},{"$f":"IF($K$1=1,D592,G592)","v":"sweet"},null,{"$f":"IF($K$1=1,IF(E592=\"\",\"\",E592),IF(H592=\"\",\"\",H592))","v":""},{"$f":"IF($K$1=1,G592,D592)","v":"süß"}]
[null,"05-Animals",{"$f":"IF(AND(LEFT(D593,1)=\"d\",MID(D593,4,1)=\" \"),RIGHT(D593,LEN(D593)-4),D593)","v":"Katze"},"die Katze",null,0,"cat",null,1,{"$f":"RAND()","v":0.19125394419434483},{"$f":"IF(Table24[[#This Row],[Type Here]]=\"\",\"\",IF(Table24[[#This Row],[Type Here]]=Table24[[#This Row],[Answer]],1,-2))","v":""},{"$f":"IF($K$1=1,Table24[[#This Row],[Strength1]],Table24[[#This Row],[Strength2]])","v":1},{"$f":"IF($K$1=1,D593,G593)","v":"cat"},null,{"$f":"IF($K$1=1,IF(E593=\"\",\"\",E593),IF(H593=\"\",\"\",H593))","v":""},{"$f":"IF($K$1=1,G593,D593)","v":"die Katze"}]
[null,"04-Food",{"$f":"IF(AND(LEFT(D594,1)=\"d\",MID(D594,4,1)=\" \"),RIGHT(D594,LEN(D594)-4),D594)","v":"Vegetarierinnen"},"die Vegetarierinnen",null,0,"vegetarians","female plural",3,{"$f":"RAND()","v":0.7302971441469485},{"$f":"IF(Table24[[#This Row],[Type Here]]=\"\",\"\",IF(Table24[[#This Row],[Type Here]]=Table24[[#This Row],[Answer]],1,-2))","v":""},{"$f":"IF($K$1=1,Table24[[#This Row],[Strength1]],Table24[[#This Row],[Strength2]])","v":3},{"$f":"IF($K$1=1,D594,G594)","v":"vegetarians"},null,{"$f":"IF($K$1=1,IF(E594=\"\",\"\",E594),IF(H594=\"\",\"\",H594))","v":"female plural"},{"$f":"IF($K$1=1,G594,D594)","v":"die Vegetarierinnen"}]
[null,"40-Places",{"$f":"IF(AND(LEFT(D595,1)=\"d\",MID(D595,4,1)=\" \"),RIGHT(D595,LEN(D595)-4),D595)","v":"Brücken"},"die Brücken",null,0,"bridges",null,0,{"$f":"RAND()","v":0.26767369258382256},{"$f":"IF(Table24[[#This Row],[Type Here]]=\"\",\"\",IF(Table24[[#This Row],[Type Here]]=Table24[[#This Row],[Answer]],1,-2))","v":""},{"$f":"IF($K$1=1,Table24[[#This Row],[Strength1]],Table24[[#This Row],[Strength2]])","v":0},{"$f":"IF($K$1=1,D595,G595)","v":"bridges"},null,{"$f":"IF($K$1=1,IF(E595=\"\",\"\",E595),IF(H595=\"\",\"\",H595))","v":""},{"$f":"IF($K$1=1,G595,D595)","v":"die Brücken"}]
[null,"39-Adj: Acc.",{"$f":"IF(AND(LEFT(D596,1)=\"d\",MID(D596,4,1)=\" \"),RIGHT(D596,LEN(D596)-4),D596)","v":"verfügbar"},"verfügbar",null,0,"ready","(available)",4,{"$f":"RAND()","v":0.7650215796114691},{"$f":"IF(Table24[[#This Row],[Type Here]]=\"\",\"\",IF(Table24[[#This Row],[Type Here]]=Table24[[#This Row],[Answer]],1,-2))","v":""},{"$f":"IF($K$1=1,Table24[[#This Row],[Strength1]],Table24[[#This Row],[Strength2]])","v":4},{"$f":"IF($K$1=1,D596,G596)","v":"ready"},null,{"$f":"IF($K$1=1,IF(E596=\"\",\"\",E596),IF(H596=\"\",\"\",H596))","v":"(available)"},{"$f":"IF($K$1=1,G596,D596)","v":"verfügbar"}]
[null,"29-Medical",{"$f":"IF(AND(LEFT(D597,1)=\"d\",MID(D597,4,1)=\" \"),RIGHT(D597,LEN(D597)-4),D597)","v":"zu Fuß gehen"},"zu Fuß gehen",null,0,"to go on foot",null,3,{"$f":"RAND()","v":0.0785255188210362},{"$f":"IF(Table24[[#This Row],[Type Here]]=\"\",\"\",IF(Table24[[#This Row],[Type Here]]=Table24[[#This Row],[Answer]],1,-2))","v":""},{"$f":"IF($K$1=1,Table24[[#This Row],[Strength1]],Table24[[#This Row],[Strength2]])","v":3},{"$f":"IF($K$1=1,D597,G597)","v":"to go on foot"},null,{"$f":"IF($K$1=1,IF(E597=\"\",\"\",E597),IF(H597=\"\",\"\",H597))","v":""},{"$f":"IF($K$1=1,G597,D597)","v":"zu Fuß gehen"}]
[null,"36-Nature",{"$f":"IF(AND(LEFT(D598,1)=\"d\",MID(D598,4,1)=\" \"),RIGHT(D598,LEN(D598)-4),D598)","v":"Winde"},"die Winde",null,0,"winds",null,6,{"$f":"RAND()","v":0.5193583449776533},{"$f":"IF(Table24[[#This Row],[Type Here]]=\"\",\"\",IF(Table24[[#This Row],[Type Here]]=Table24[[#This Row],[Answer]],1,-2))","v":""},{"$f":"IF($K$1=1,Table24[[#This Row],[Strength1]],Table24[[#This Row],[Strength2]])","v":6},{"$f":"IF($K$1=1,D598,G598)","v":"winds"},null,{"$f":"IF($K$1=1,IF(E598=\"\",\"\",E598),IF(H598=\"\",\"\",H598))","v":""},{"$f":"IF($K$1=1,G598,D598)","v":"die Winde"}]
[null,"29-Medical",{"$f":"IF(AND(LEFT(D599,1)=\"d\",MID(D599,4,1)=\" \"),RIGHT(D599,LEN(D599)-4),D599)","v":"Unfall"},"der Unfall",null,0,"accident",null,2,{"$f":"RAND()","v":0.008502079390249717},{"$f":"IF(Table24[[#This Row],[Type Here]]=\"\",\"\",IF(Table24[[#This Row],[Type Here]]=Table24[[#This Row],[Answer]],1,-2))","v":""},{"$f":"IF($K$1=1,Table24[[#This Row],[Strength1]],Table24[[#This Row],[Strength2]])","v":2},{"$f":"IF($K$1=1,D599,G599)","v":"accident"},null,{"$f":"IF($K$1=1,IF(E599=\"\",\"\",E599),IF(H599=\"\",\"\",H599))","v":""},{"$f":"IF($K$1=1,G599,D599)","v":"der Unfall"}]
[null,"40-Places",{"$f":"IF(AND(LEFT(D600,1)=\"d\",MID(D600,4,1)=\" \"),RIGHT(D600,LEN(D600)-4),D600)","v":"Brücke"},"die Brücke",null,0,"bridge",null,-4,{"$f":"RAND()","v":0.3102227782479745},{"$f":"IF(Table24[[#This Row],[Type Here]]=\"\",\"\",IF(Table24[[#This Row],[Type Here]]=Table24[[#This Row],[Answer]],1,-2))","v":""},{"$f":"IF($K$1=1,Table24[[#This Row],[Strength1]],Table24[[#This Row],[Strength2]])","v":-4},{"$f":"IF($K$1=1,D600,G600)","v":"bridge"},null,{"$f":"IF($K$1=1,IF(E600=\"\",\"\",E600),IF(H600=\"\",\"\",H600))","v":""},{"$f":"IF($K$1=1,G600,D600)","v":"die Brücke"}]
[null,"03-Phrases",{"$f":"IF(AND(LEFT(D601,1)=\"d\",MID(D601,4,1)=\" \"),RIGHT(D601,LEN(D601)-4),D601)","v":"willkommen"},"willkommen",null,0,"welcome",null,0,{"$f":"RAND()","v":0.6752802343436783},{"$f":"IF(Table24[[#This Row],[Type Here]]=\"\",\"\",IF(Table24[[#This Row],[Type Here]]=Table24[[#This Row],[Answer]],1,-2))","v":""},{"$f":"IF($K$1=1,Table24[[#This Row],[Strength1]],Table24[[#This Row],[Strength2]])","v":0},{"$f":"IF($K$1=1,D601,G601)","v":"welcome"},null,{"$f":"IF($K$1=1,IF(E601=\"\",\"\",E601),IF(H601=\"\",\"\",H601))","v":""},{"$f":"IF($K$1=1,G601,D601)","v":"willkommen"}]
[null,"01-Basics 1",{"$f":"IF(AND(LEFT(D602,1)=\"d\",MID(D602,4,1)=\" \"),RIGHT(D602,LEN(D602)-4),D602)","v":"er isst"},"er isst",null,0,"he eats",null,0,{"$f":"RAND()","v":0.14579194287580943},{"$f":"IF(Table24[[#This Row],[Type Here]]=\"\",\"\",IF(Table24[[#This Row],[Type Here]]=Table24[[#This Row],[Answer]],1,-2))","v":""},{"$f":"IF($K$1=1,Table24[[#This Row],[Strength1]],Table24[[#This Row],[Strength2]])","v":0},{"$f":"IF($K$1=1,D602,G602)","v":"he eats"},null,{"$f":"IF($K$1=1,IF(E602=\"\",\"\",E602),IF(H602=\"\",\"\",H602))","v":""},{"$f":"IF($K$1=1,G602,D602)","v":"er isst"}]
[null,"06-Plurals",{"$f":"IF(AND(LEFT(D603,1)=\"d\",MID(D603,4,1)=\" \"),RIGHT(D603,LEN(D603)-4),D603)","v":"Orangen"},"die Orangen",null,0,"oranges",null,4,{"$f":"RAND()","v":0.012266084662624244},{"$f":"IF(Table24[[#This Row],[Type Here]]=\"\",\"\",IF(Table24[[#This Row],[Type Here]]=Table24[[#This Row],[Answer]],1,-2))","v":""},{"$f":"IF($K$1=1,Table24[[#This Row],[Strength1]],Table24[[#This Row],[Strength2]])","v":4},{"$f":"IF($K$1=1,D603,G603)","v":"oranges"},null,{"$f":"IF($K$1=1,IF(E603=\"\",\"\",E603),IF(H603=\"\",\"\",H603))","v":""},{"$f":"IF($K$1=1,G603,D603)","v":"die Orangen"}]
[null,"29-Medical",{"$f":"IF(AND(LEFT(D604,1)=\"d\",MID(D604,4,1)=\" \"),RIGHT(D604,LEN(D604)-4),D604)","v":"Alkohol"},"der Alkohol",null,0,"alcohol",null,-2,{"$f":"RAND()","v":0.3383158275467647},{"$f":"IF(Table24[[#This Row],[Type Here]]=\"\",\"\",IF(Table24[[#This Row],[Type Here]]=Table24[[#This Row],[Answer]],1,-2))","v":""},{"$f":"IF($K$1=1,Table24[[#This Row],[Strength1]],Table24[[#This Row],[Strength2]])","v":-2},{"$f":"IF($K$1=1,D604,G604)","v":"alcohol"},null,{"$f":"IF($K$1=1,IF(E604=\"\",\"\",E604),IF(H604=\"\",\"\",H604))","v":""},{"$f":"IF($K$1=1,G604,D604)","v":"der Alkohol"}]
[null,"33-Adverbs 1",{"$f":"IF(AND(LEFT(D605,1)=\"d\",MID(D605,4,1)=\" \"),RIGHT(D605,LEN(D605)-4),D605)","v":"ab jetzt"},"ab jetzt",null,0,"from now on",null,1,{"$f":"RAND()","v":0.3133271465413562},{"$f":"IF(Table24[[#This Row],[Type Here]]=\"\",\"\",IF(Table24[[#This Row],[Type Here]]=Table24[[#This Row],[Answer]],1,-2))","v":""},{"$f":"IF($K$1=1,Table24[[#This Row],[Strength1]],Table24[[#This Row],[Strength2]])","v":1},{"$f":"IF($K$1=1,D605,G605)","v":"from now on"},null,{"$f":"IF($K$1=1,IF(E605=\"\",\"\",E605),IF(H605=\"\",\"\",H605))","v":""},{"$f":"IF($K$1=1,G605,D605)","v":"ab jetzt"}]
[null,"29-Medical",{"$f":"IF(AND(LEFT(D606,1)=\"d\",MID(D606,4,1)=\" \"),RIGHT(D606,LEN(D606)-4),D606)","v":"Herzen"},"die Herzen",null,0,"hearts",null,0,{"$f":"RAND()","v":0.8322265819301352},{"$f":"IF(Table24[[#This Row],[Type Here]]=\"\",\"\",IF(Table24[[#This Row],[Type Here]]=Table24[[#This Row],[Answer]],1,-2))","v":""},{"$f":"IF($K$1=1,Table24[[#This Row],[Strength1]],Table24[[#This Row],[Strength2]])","v":0},{"$f":"IF($K$1=1,D606,G606)","v":"hearts"},null,{"$f":"IF($K$1=1,IF(E606=\"\",\"\",E606),IF(H606=\"\",\"\",H606))","v":""},{"$f":"IF($K$1=1,G606,D606)","v":"die Herzen"}]
[null,"14-Household",{"$f":"IF(AND(LEFT(D607,1)=\"d\",MID(D607,4,1)=\" \"),RIGHT(D607,LEN(D607)-4),D607)","v":"Heizungen"},"die Heizungen",null,0,"heaters",null,1,{"$f":"RAND()","v":0.4907435553198969},{"$f":"IF(Table24[[#This Row],[Type Here]]=\"\",\"\",IF(Table24[[#This Row],[Type Here]]=Table24[[#This Row],[Answer]],1,-2))","v":""},{"$f":"IF($K$1=1,Table24[[#This Row],[Strength1]],Table24[[#This Row],[Strength2]])","v":1},{"$f":"IF($K$1=1,D607,G607)","v":"heaters"},null,{"$f":"IF($K$1=1,IF(E607=\"\",\"\",E607),IF(H607=\"\",\"\",H607))","v":""},{"$f":"IF($K$1=1,G607,D607)","v":"die Heizungen"}]
[null,"07-Adjectives",{"$f":"IF(AND(LEFT(D608,1)=\"d\",MID(D608,4,1)=\" \"),RIGHT(D608,LEN(D608)-4),D608)","v":"fertig"},"fertig",null,0,"ready","(finished)",0,{"$f":"RAND()","v":0.4087728938286882},{"$f":"IF(Table24[[#This Row],[Type Here]]=\"\",\"\",IF(Table24[[#This Row],[Type Here]]=Table24[[#This Row],[Answer]],1,-2))","v":""},{"$f":"IF($K$1=1,Table24[[#This Row],[Strength1]],Table24[[#This Row],[Strength2]])","v":0},{"$f":"IF($K$1=1,D608,G608)","v":"ready"},null,{"$f":"IF($K$1=1,IF(E608=\"\",\"\",E608),IF(H608=\"\",\"\",H608))","v":"(finished)"},{"$f":"IF($K$1=1,G608,D608)","v":"fertig"}]
[null,"29-Medical",{"$f":"IF(AND(LEFT(D609,1)=\"d\",MID(D609,4,1)=\" \"),RIGHT(D609,LEN(D609)-4),D609)","v":"Krankenhaus"},"das Krankenhaus",null,0,"hospital",null,3,{"$f":"RAND()","v":0.3256656527833728},{"$f":"IF(Table24[[#This Row],[Type Here]]=\"\",\"\",IF(Table24[[#This Row],[Type Here]]=Table24[[#This Row],[Answer]],1,-2))","v":""},{"$f":"IF($K$1=1,Table24[[#This Row],[Strength1]],Table24[[#This Row],[Strength2]])","v":3},{"$f":"IF($K$1=1,D609,G609)","v":"hospital"},null,{"$f":"IF($K$1=1,IF(E609=\"\",\"\",E609),IF(H609=\"\",\"\",H609))","v":""},{"$f":"IF($K$1=1,G609,D609)","v":"das Krankenhaus"}]
[null,"14-Household",{"$f":"IF(AND(LEFT(D610,1)=\"d\",MID(D610,4,1)=\" \"),RIGHT(D610,LEN(D610)-4),D610)","v":"Schüsseln"},"die Schüsseln",null,0,"bowls",null,-2,{"$f":"RAND()","v":0.2990845364616246},{"$f":"IF(Table24[[#This Row],[Type Here]]=\"\",\"\",IF(Table24[[#This Row],[Type Here]]=Table24[[#This Row],[Answer]],1,-2))","v":""},{"$f":"IF($K$1=1,Table24[[#This Row],[Strength1]],Table24[[#This Row],[Strength2]])","v":-2},{"$f":"IF($K$1=1,D610,G610)","v":"bowls"},null,{"$f":"IF($K$1=1,IF(E610=\"\",\"\",E610),IF(H610=\"\",\"\",H610))","v":""},{"$f":"IF($K$1=1,G610,D610)","v":"die Schüsseln"}]
[null,"03-Phrases",{"$f":"IF(AND(LEFT(D611,1)=\"d\",MID(D611,4,1)=\" \"),RIGHT(D611,LEN(D611)-4),D611)","v":"nicht"},"nicht",null,0,"not",null,1,{"$f":"RAND()","v":0.552727319447388},{"$f":"IF(Table24[[#This Row],[Type Here]]=\"\",\"\",IF(Table24[[#This Row],[Type Here]]=Table24[[#This Row],[Answer]],1,-2))","v":""},{"$f":"IF($K$1=1,Table24[[#This Row],[Strength1]],Table24[[#This Row],[Strength2]])","v":1},{"$f":"IF($K$1=1,D611,G611)","v":"not"},null,{"$f":"IF($K$1=1,IF(E611=\"\",\"\",E611),IF(H611=\"\",\"\",H611))","v":""},{"$f":"IF($K$1=1,G611,D611)","v":"nicht"}]
[null,"40-Places",{"$f":"IF(AND(LEFT(D612,1)=\"d\",MID(D612,4,1)=\" \"),RIGHT(D612,LEN(D612)-4),D612)","v":"Ring"},"der Ring",null,0,"ring","noun",4,{"$f":"RAND()","v":0.19231530129124508},{"$f":"IF(Table24[[#This Row],[Type Here]]=\"\",\"\",IF(Table24[[#This Row],[Type Here]]=Table24[[#This Row],[Answer]],1,-2))","v":""},{"$f":"IF($K$1=1,Table24[[#This Row],[Strength1]],Table24[[#This Row],[Strength2]])","v":4},{"$f":"IF($K$1=1,D612,G612)","v":"ring"},null,{"$f":"IF($K$1=1,IF(E612=\"\",\"\",E612),IF(H612=\"\",\"\",H612))","v":"noun"},{"$f":"IF($K$1=1,G612,D612)","v":"der Ring"}]
[null,"08-V. Pres. 1",{"$f":"IF(AND(LEFT(D613,1)=\"d\",MID(D613,4,1)=\" \"),RIGHT(D613,LEN(D613)-4),D613)","v":"reichen"},"reichen",null,0,"to reach","(to hand)",0,{"$f":"RAND()","v":0.9308884296811787},{"$f":"IF(Table24[[#This Row],[Type Here]]=\"\",\"\",IF(Table24[[#This Row],[Type Here]]=Table24[[#This Row],[Answer]],1,-2))","v":""},{"$f":"IF($K$1=1,Table24[[#This Row],[Strength1]],Table24[[#This Row],[Strength2]])","v":0},{"$f":"IF($K$1=1,D613,G613)","v":"to reach"},null,{"$f":"IF($K$1=1,IF(E613=\"\",\"\",E613),IF(H613=\"\",\"\",H613))","v":"(to hand)"},{"$f":"IF($K$1=1,G613,D613)","v":"reichen"}]
[null,"14-Household",{"$f":"IF(AND(LEFT(D614,1)=\"d\",MID(D614,4,1)=\" \"),RIGHT(D614,LEN(D614)-4),D614)","v":"Treppe"},"die Treppe",null,0,"stairs","(staircase)",2,{"$f":"RAND()","v":0.07819191018354443},{"$f":"IF(Table24[[#This Row],[Type Here]]=\"\",\"\",IF(Table24[[#This Row],[Type Here]]=Table24[[#This Row],[Answer]],1,-2))","v":""},{"$f":"IF($K$1=1,Table24[[#This Row],[Strength1]],Table24[[#This Row],[Strength2]])","v":2},{"$f":"IF($K$1=1,D614,G614)","v":"stairs"},null,{"$f":"IF($K$1=1,IF(E614=\"\",\"\",E614),IF(H614=\"\",\"\",H614))","v":"(staircase)"},{"$f":"IF($K$1=1,G614,D614)","v":"die Treppe"}]
[null,"12-Acc. Pron.",{"$f":"IF(AND(LEFT(D615,1)=\"d\",MID(D615,4,1)=\" \"),RIGHT(D615,LEN(D615)-4),D615)","v":"uns"},"uns",null,null,"us",null,null,{"$f":"RAND()","v":0.38249650635120025},{"$f":"IF(Table24[[#This Row],[Type Here]]=\"\",\"\",IF(Table24[[#This Row],[Type Here]]=Table24[[#This Row],[Answer]],1,-2))","v":""},{"$f":"IF($K$1=1,Table24[[#This Row],[Strength1]],Table24[[#This Row],[Strength2]])","v":0},{"$f":"IF($K$1=1,D615,G615)","v":"us"},null,{"$f":"IF($K$1=1,IF(E615=\"\",\"\",E615),IF(H615=\"\",\"\",H615))","v":""},{"$f":"IF($K$1=1,G615,D615)","v":"uns"}]
[null,"11-Family",{"$f":"IF(AND(LEFT(D616,1)=\"d\",MID(D616,4,1)=\" \"),RIGHT(D616,LEN(D616)-4),D616)","v":"Großvater"},"der Großvater",null,null,"grandfather",null,null,{"$f":"RAND()","v":0.3350228096840506},{"$f":"IF(Table24[[#This Row],[Type Here]]=\"\",\"\",IF(Table24[[#This Row],[Type Here]]=Table24[[#This Row],[Answer]],1,-2))","v":""},{"$f":"IF($K$1=1,Table24[[#This Row],[Strength1]],Table24[[#This Row],[Strength2]])","v":0},{"$f":"IF($K$1=1,D616,G616)","v":"grandfather"},null,{"$f":"IF($K$1=1,IF(E616=\"\",\"\",E616),IF(H616=\"\",\"\",H616))","v":""},{"$f":"IF($K$1=1,G616,D616)","v":"der Großvater"}]
[null,"33-Adverbs 1",{"$f":"IF(AND(LEFT(D617,1)=\"d\",MID(D617,4,1)=\" \"),RIGHT(D617,LEN(D617)-4),D617)","v":"selber"},"selber",null,0,"self","spoken, less formal",0,{"$f":"RAND()","v":0.5171249687577594},{"$f":"IF(Table24[[#This Row],[Type Here]]=\"\",\"\",IF(Table24[[#This Row],[Type Here]]=Table24[[#This Row],[Answer]],1,-2))","v":""},{"$f":"IF($K$1=1,Table24[[#This Row],[Strength1]],Table24[[#This Row],[Strength2]])","v":0},{"$f":"IF($K$1=1,D617,G617)","v":"self"},null,{"$f":"IF($K$1=1,IF(E617=\"\",\"\",E617),IF(H617=\"\",\"\",H617))","v":"spoken, less formal"},{"$f":"IF($K$1=1,G617,D617)","v":"selber"}]
[null,"14-Household",{"$f":"IF(AND(LEFT(D618,1)=\"d\",MID(D618,4,1)=\" \"),RIGHT(D618,LEN(D618)-4),D618)","v":"Wohnungen"},"die Wohnungen",null,0,"dwellings",null,-1,{"$f":"RAND()","v":0.6924603213569591},{"$f":"IF(Table24[[#This Row],[Type Here]]=\"\",\"\",IF(Table24[[#This Row],[Type Here]]=Table24[[#This Row],[Answer]],1,-2))","v":""},{"$f":"IF($K$1=1,Table24[[#This Row],[Strength1]],Table24[[#This Row],[Strength2]])","v":-1},{"$f":"IF($K$1=1,D618,G618)","v":"dwellings"},null,{"$f":"IF($K$1=1,IF(E618=\"\",\"\",E618),IF(H618=\"\",\"\",H618))","v":""},{"$f":"IF($K$1=1,G618,D618)","v":"die Wohnungen"}]
[null,"33-Adverbs 1",{"$f":"IF(AND(LEFT(D619,1)=\"d\",MID(D619,4,1)=\" \"),RIGHT(D619,LEN(D619)-4),D619)","v":"wieder"},"wieder",null,0,"again",null,1,{"$f":"RAND()","v":0.5855804989754584},{"$f":"IF(Table24[[#This Row],[Type Here]]=\"\",\"\",IF(Table24[[#This Row],[Type Here]]=Table24[[#This Row],[Answer]],1,-2))","v":""},{"$f":"IF($K$1=1,Table24[[#This Row],[Strength1]],Table24[[#This Row],[Strength2]])","v":1},{"$f":"IF($K$1=1,D619,G619)","v":"again"},null,{"$f":"IF($K$1=1,IF(E619=\"\",\"\",E619),IF(H619=\"\",\"\",H619))","v":""},{"$f":"IF($K$1=1,G619,D619)","v":"wieder"}]
[null,"04-Food",{"$f":"IF(AND(LEFT(D620,1)=\"d\",MID(D620,4,1)=\" \"),RIGHT(D620,LEN(D620)-4),D620)","v":"Schokolade"},"die Schokolade",null,0,"chocolate",null,3,{"$f":"RAND()","v":0.058690900901793186},{"$f":"IF(Table24[[#This Row],[Type Here]]=\"\",\"\",IF(Table24[[#This Row],[Type Here]]=Table24[[#This Row],[Answer]],1,-2))","v":""},{"$f":"IF($K$1=1,Table24[[#This Row],[Strength1]],Table24[[#This Row],[Strength2]])","v":3},{"$f":"IF($K$1=1,D620,G620)","v":"chocolate"},null,{"$f":"IF($K$1=1,IF(E620=\"\",\"\",E620),IF(H620=\"\",\"\",H620))","v":""},{"$f":"IF($K$1=1,G620,D620)","v":"die Schokolade"}]
[null,"14-Household",{"$f":"IF(AND(LEFT(D621,1)=\"d\",MID(D621,4,1)=\" \"),RIGHT(D621,LEN(D621)-4),D621)","v":"Teller"},"die Teller",null,0,"plates",null,2,{"$f":"RAND()","v":0.7783350070674887},{"$f":"IF(Table24[[#This Row],[Type Here]]=\"\",\"\",IF(Table24[[#This Row],[Type Here]]=Table24[[#This Row],[Answer]],1,-2))","v":""},{"$f":"IF($K$1=1,Table24[[#This Row],[Strength1]],Table24[[#This Row],[Strength2]])","v":2},{"$f":"IF($K$1=1,D621,G621)","v":"plates"},null,{"$f":"IF($K$1=1,IF(E621=\"\",\"\",E621),IF(H621=\"\",\"\",H621))","v":""},{"$f":"IF($K$1=1,G621,D621)","v":"die Teller"}]
[null,"10-Nom. Pron.",{"$f":"IF(AND(LEFT(D622,1)=\"d\",MID(D622,4,1)=\" \"),RIGHT(D622,LEN(D622)-4),D622)","v":"dein"},"dein",null,0,"your","familiar singular",1,{"$f":"RAND()","v":0.9886624627003738},{"$f":"IF(Table24[[#This Row],[Type Here]]=\"\",\"\",IF(Table24[[#This Row],[Type Here]]=Table24[[#This Row],[Answer]],1,-2))","v":""},{"$f":"IF($K$1=1,Table24[[#This Row],[Strength1]],Table24[[#This Row],[Strength2]])","v":1},{"$f":"IF($K$1=1,D622,G622)","v":"your"},null,{"$f":"IF($K$1=1,IF(E622=\"\",\"\",E622),IF(H622=\"\",\"\",H622))","v":"familiar singular"},{"$f":"IF($K$1=1,G622,D622)","v":"dein"}]
[null,"38-Ad: Nom. 1",{"$f":"IF(AND(LEFT(D623,1)=\"d\",MID(D623,4,1)=\" \"),RIGHT(D623,LEN(D623)-4),D623)","v":"öffentlich"},"öffentlich",null,0,"public",null,3,{"$f":"RAND()","v":0.5876014024086914},{"$f":"IF(Table24[[#This Row],[Type Here]]=\"\",\"\",IF(Table24[[#This Row],[Type Here]]=Table24[[#This Row],[Answer]],1,-2))","v":""},{"$f":"IF($K$1=1,Table24[[#This Row],[Strength1]],Table24[[#This Row],[Strength2]])","v":3},{"$f":"IF($K$1=1,D623,G623)","v":"public"},null,{"$f":"IF($K$1=1,IF(E623=\"\",\"\",E623),IF(H623=\"\",\"\",H623))","v":""},{"$f":"IF($K$1=1,G623,D623)","v":"öffentlich"}]
[null,"36-Nature",{"$f":"IF(AND(LEFT(D624,1)=\"d\",MID(D624,4,1)=\" \"),RIGHT(D624,LEN(D624)-4),D624)","v":"Bäume"},"die Bäume",null,0,"trees",null,6,{"$f":"RAND()","v":0.27807923238477017},{"$f":"IF(Table24[[#This Row],[Type Here]]=\"\",\"\",IF(Table24[[#This Row],[Type Here]]=Table24[[#This Row],[Answer]],1,-2))","v":""},{"$f":"IF($K$1=1,Table24[[#This Row],[Strength1]],Table24[[#This Row],[Strength2]])","v":6},{"$f":"IF($K$1=1,D624,G624)","v":"trees"},null,{"$f":"IF($K$1=1,IF(E624=\"\",\"\",E624),IF(H624=\"\",\"\",H624))","v":""},{"$f":"IF($K$1=1,G624,D624)","v":"die Bäume"}]
[null,"12-Acc. Pron.",{"$f":"IF(AND(LEFT(D625,1)=\"d\",MID(D625,4,1)=\" \"),RIGHT(D625,LEN(D625)-4),D625)","v":"mich"},"mich",null,null,"me",null,null,{"$f":"RAND()","v":0.29723399970060393},{"$f":"IF(Table24[[#This Row],[Type Here]]=\"\",\"\",IF(Table24[[#This Row],[Type Here]]=Table24[[#This Row],[Answer]],1,-2))","v":""},{"$f":"IF($K$1=1,Table24[[#This Row],[Strength1]],Table24[[#This Row],[Strength2]])","v":0},{"$f":"IF($K$1=1,D625,G625)","v":"me"},null,{"$f":"IF($K$1=1,IF(E625=\"\",\"\",E625),IF(H625=\"\",\"\",H625))","v":""},{"$f":"IF($K$1=1,G625,D625)","v":"mich"}]
[null,"04-Food",{"$f":"IF(AND(LEFT(D626,1)=\"d\",MID(D626,4,1)=\" \"),RIGHT(D626,LEN(D626)-4),D626)","v":"Weine"},"die Weine",null,0,"wines",null,3,{"$f":"RAND()","v":0.6087715775049419},{"$f":"IF(Table24[[#This Row],[Type Here]]=\"\",\"\",IF(Table24[[#This Row],[Type Here]]=Table24[[#This Row],[Answer]],1,-2))","v":""},{"$f":"IF($K$1=1,Table24[[#This Row],[Strength1]],Table24[[#This Row],[Strength2]])","v":3},{"$f":"IF($K$1=1,D626,G626)","v":"wines"},null,{"$f":"IF($K$1=1,IF(E626=\"\",\"\",E626),IF(H626=\"\",\"\",H626))","v":""},{"$f":"IF($K$1=1,G626,D626)","v":"die Weine"}]
[null,"33-Adverbs 1",{"$f":"IF(AND(LEFT(D627,1)=\"d\",MID(D627,4,1)=\" \"),RIGHT(D627,LEN(D627)-4),D627)","v":"von...allein"},"von...allein",null,0,"on its own",null,0,{"$f":"RAND()","v":0.3852151313832306},{"$f":"IF(Table24[[#This Row],[Type Here]]=\"\",\"\",IF(Table24[[#This Row],[Type Here]]=Table24[[#This Row],[Answer]],1,-2))","v":""},{"$f":"IF($K$1=1,Table24[[#This Row],[Strength1]],Table24[[#This Row],[Strength2]])","v":0},{"$f":"IF($K$1=1,D627,G627)","v":"on its own"},null,{"$f":"IF($K$1=1,IF(E627=\"\",\"\",E627),IF(H627=\"\",\"\",H627))","v":""},{"$f":"IF($K$1=1,G627,D627)","v":"von...allein"}]
[null,"01-Basics 1",{"$f":"IF(AND(LEFT(D628,1)=\"d\",MID(D628,4,1)=\" \"),RIGHT(D628,LEN(D628)-4),D628)","v":"er"},"er",null,0,"he",null,1,{"$f":"RAND()","v":0.8911299121202896},{"$f":"IF(Table24[[#This Row],[Type Here]]=\"\",\"\",IF(Table24[[#This Row],[Type Here]]=Table24[[#This Row],[Answer]],1,-2))","v":""},{"$f":"IF($K$1=1,Table24[[#This Row],[Strength1]],Table24[[#This Row],[Strength2]])","v":1},{"$f":"IF($K$1=1,D628,G628)","v":"he"},null,{"$f":"IF($K$1=1,IF(E628=\"\",\"\",E628),IF(H628=\"\",\"\",H628))","v":""},{"$f":"IF($K$1=1,G628,D628)","v":"er"}]
[null,"12-Acc. Pron.",{"$f":"IF(AND(LEFT(D629,1)=\"d\",MID(D629,4,1)=\" \"),RIGHT(D629,LEN(D629)-4),D629)","v":"ihr"},"ihr","(dative pronoun)",null,"her","(dative pronoun)",null,{"$f":"RAND()","v":0.34749877316576816},{"$f":"IF(Table24[[#This Row],[Type Here]]=\"\",\"\",IF(Table24[[#This Row],[Type Here]]=Table24[[#This Row],[Answer]],1,-2))","v":""},{"$f":"IF($K$1=1,Table24[[#This Row],[Strength1]],Table24[[#This Row],[Strength2]])","v":0},{"$f":"IF($K$1=1,D629,G629)","v":"her"},null,{"$f":"IF($K$1=1,IF(E629=\"\",\"\",E629),IF(H629=\"\",\"\",H629))","v":"(dative pronoun)"},{"$f":"IF($K$1=1,G629,D629)","v":"ihr"}]
[null,"36-Nature",{"$f":"IF(AND(LEFT(D630,1)=\"d\",MID(D630,4,1)=\" \"),RIGHT(D630,LEN(D630)-4),D630)","v":"Umwelt"},"die Umwelt",null,0,"environment",null,6,{"$f":"RAND()","v":0.44023046922392295},{"$f":"IF(Table24[[#This Row],[Type Here]]=\"\",\"\",IF(Table24[[#This Row],[Type Here]]=Table24[[#This Row],[Answer]],1,-2))","v":""},{"$f":"IF($K$1=1,Table24[[#This Row],[Strength1]],Table24[[#This Row],[Strength2]])","v":6},{"$f":"IF($K$1=1,D630,G630)","v":"environment"},null,{"$f":"IF($K$1=1,IF(E630=\"\",\"\",E630),IF(H630=\"\",\"\",H630))","v":""},{"$f":"IF($K$1=1,G630,D630)","v":"die Umwelt"}]
[null,"02-Basics 2",{"$f":"IF(AND(LEFT(D631,1)=\"d\",MID(D631,4,1)=\" \"),RIGHT(D631,LEN(D631)-4),D631)","v":"du hast"},"du hast",null,0,"you have","informal singular",0,{"$f":"RAND()","v":0.06376938690151202},{"$f":"IF(Table24[[#This Row],[Type Here]]=\"\",\"\",IF(Table24[[#This Row],[Type Here]]=Table24[[#This Row],[Answer]],1,-2))","v":""},{"$f":"IF($K$1=1,Table24[[#This Row],[Strength1]],Table24[[#This Row],[Strength2]])","v":0},{"$f":"IF($K$1=1,D631,G631)","v":"you have"},null,{"$f":"IF($K$1=1,IF(E631=\"\",\"\",E631),IF(H631=\"\",\"\",H631))","v":"informal singular"},{"$f":"IF($K$1=1,G631,D631)","v":"du hast"}]
[null,"14-Household",{"$f":"IF(AND(LEFT(D632,1)=\"d\",MID(D632,4,1)=\" \"),RIGHT(D632,LEN(D632)-4),D632)","v":"Tür"},"die Tür",null,0,"door",null,1,{"$f":"RAND()","v":0.8647761092321393},{"$f":"IF(Table24[[#This Row],[Type Here]]=\"\",\"\",IF(Table24[[#This Row],[Type Here]]=Table24[[#This Row],[Answer]],1,-2))","v":""},{"$f":"IF($K$1=1,Table24[[#This Row],[Strength1]],Table24[[#This Row],[Strength2]])","v":1},{"$f":"IF($K$1=1,D632,G632)","v":"door"},null,{"$f":"IF($K$1=1,IF(E632=\"\",\"\",E632),IF(H632=\"\",\"\",H632))","v":""},{"$f":"IF($K$1=1,G632,D632)","v":"die Tür"}]
[null,"14-Household",{"$f":"IF(AND(LEFT(D633,1)=\"d\",MID(D633,4,1)=\" \"),RIGHT(D633,LEN(D633)-4),D633)","v":"Haus"},"das Haus",null,0,"house",null,1,{"$f":"RAND()","v":0.44218653550354736},{"$f":"IF(Table24[[#This Row],[Type Here]]=\"\",\"\",IF(Table24[[#This Row],[Type Here]]=Table24[[#This Row],[Answer]],1,-2))","v":""},{"$f":"IF($K$1=1,Table24[[#This Row],[Strength1]],Table24[[#This Row],[Strength2]])","v":1},{"$f":"IF($K$1=1,D633,G633)","v":"house"},null,{"$f":"IF($K$1=1,IF(E633=\"\",\"\",E633),IF(H633=\"\",\"\",H633))","v":""},{"$f":"IF($K$1=1,G633,D633)","v":"das Haus"}]
[null,"29-Medical",{"$f":"IF(AND(LEFT(D634,1)=\"d\",MID(D634,4,1)=\" \"),RIGHT(D634,LEN(D634)-4),D634)","v":"Patienten"},"die Patienten",null,0,"patients","male (medical)",5,{"$f":"RAND()","v":0.2537753963321221},{"$f":"IF(Table24[[#This Row],[Type Here]]=\"\",\"\",IF(Table24[[#This Row],[Type Here]]=Table24[[#This Row],[Answer]],1,-2))","v":""},{"$f":"IF($K$1=1,Table24[[#This Row],[Strength1]],Table24[[#This Row],[Strength2]])","v":5},{"$f":"IF($K$1=1,D634,G634)","v":"patients"},null,{"$f":"IF($K$1=1,IF(E634=\"\",\"\",E634),IF(H634=\"\",\"\",H634))","v":"male (medical)"},{"$f":"IF($K$1=1,G634,D634)","v":"die Patienten"}]
[null,"02-Basics 2",{"$f":"IF(AND(LEFT(D635,1)=\"d\",MID(D635,4,1)=\" \"),RIGHT(D635,LEN(D635)-4),D635)","v":"du liest"},"du liest",null,0,"you read","informal singular",0,{"$f":"RAND()","v":0.6536206561064597},{"$f":"IF(Table24[[#This Row],[Type Here]]=\"\",\"\",IF(Table24[[#This Row],[Type Here]]=Table24[[#This Row],[Answer]],1,-2))","v":""},{"$f":"IF($K$1=1,Table24[[#This Row],[Strength1]],Table24[[#This Row],[Strength2]])","v":0},{"$f":"IF($K$1=1,D635,G635)","v":"you read"},null,{"$f":"IF($K$1=1,IF(E635=\"\",\"\",E635),IF(H635=\"\",\"\",H635))","v":"informal singular"},{"$f":"IF($K$1=1,G635,D635)","v":"du liest"}]
[null,"38-Ad: Nom. 1",{"$f":"IF(AND(LEFT(D636,1)=\"d\",MID(D636,4,1)=\" \"),RIGHT(D636,LEN(D636)-4),D636)","v":"extern"},"extern",null,0,"external",null,3,{"$f":"RAND()","v":0.9031847965656598},{"$f":"IF(Table24[[#This Row],[Type Here]]=\"\",\"\",IF(Table24[[#This Row],[Type Here]]=Table24[[#This Row],[Answer]],1,-2))","v":""},{"$f":"IF($K$1=1,Table24[[#This Row],[Strength1]],Table24[[#This Row],[Strength2]])","v":3},{"$f":"IF($K$1=1,D636,G636)","v":"external"},null,{"$f":"IF($K$1=1,IF(E636=\"\",\"\",E636),IF(H636=\"\",\"\",H636))","v":""},{"$f":"IF($K$1=1,G636,D636)","v":"extern"}]
[null,"36-Nature",{"$f":"IF(AND(LEFT(D637,1)=\"d\",MID(D637,4,1)=\" \"),RIGHT(D637,LEN(D637)-4),D637)","v":"Garten"},"der Garten",null,0,"garden",null,6,{"$f":"RAND()","v":0.6497566273223127},{"$f":"IF(Table24[[#This Row],[Type Here]]=\"\",\"\",IF(Table24[[#This Row],[Type Here]]=Table24[[#This Row],[Answer]],1,-2))","v":""},{"$f":"IF($K$1=1,Table24[[#This Row],[Strength1]],Table24[[#This Row],[Strength2]])","v":6},{"$f":"IF($K$1=1,D637,G637)","v":"garden"},null,{"$f":"IF($K$1=1,IF(E637=\"\",\"\",E637),IF(H637=\"\",\"\",H637))","v":""},{"$f":"IF($K$1=1,G637,D637)","v":"der Garten"}]
[null,"33-Adverbs 1",{"$f":"IF(AND(LEFT(D638,1)=\"d\",MID(D638,4,1)=\" \"),RIGHT(D638,LEN(D638)-4),D638)","v":"nur"},"nur",null,0,"only","(not much, limited to)",0,{"$f":"RAND()","v":0.530654861664782},{"$f":"IF(Table24[[#This Row],[Type Here]]=\"\",\"\",IF(Table24[[#This Row],[Type Here]]=Table24[[#This Row],[Answer]],1,-2))","v":""},{"$f":"IF($K$1=1,Table24[[#This Row],[Strength1]],Table24[[#This Row],[Strength2]])","v":0},{"$f":"IF($K$1=1,D638,G638)","v":"only"},null,{"$f":"IF($K$1=1,IF(E638=\"\",\"\",E638),IF(H638=\"\",\"\",H638))","v":"(not much, limited to)"},{"$f":"IF($K$1=1,G638,D638)","v":"nur"}]
[null,"04-Food",{"$f":"IF(AND(LEFT(D639,1)=\"d\",MID(D639,4,1)=\" \"),RIGHT(D639,LEN(D639)-4),D639)","v":"Nudel"},"die Nudel",null,0,"noodle",null,5,{"$f":"RAND()","v":0.22333452759864791},{"$f":"IF(Table24[[#This Row],[Type Here]]=\"\",\"\",IF(Table24[[#This Row],[Type Here]]=Table24[[#This Row],[Answer]],1,-2))","v":""},{"$f":"IF($K$1=1,Table24[[#This Row],[Strength1]],Table24[[#This Row],[Strength2]])","v":5},{"$f":"IF($K$1=1,D639,G639)","v":"noodle"},null,{"$f":"IF($K$1=1,IF(E639=\"\",\"\",E639),IF(H639=\"\",\"\",H639))","v":""},{"$f":"IF($K$1=1,G639,D639)","v":"die Nudel"}]
[null,"36-Nature",{"$f":"IF(AND(LEFT(D640,1)=\"d\",MID(D640,4,1)=\" \"),RIGHT(D640,LEN(D640)-4),D640)","v":"Holz"},"das Holz",null,0,"wood",null,5,{"$f":"RAND()","v":0.988684561640341},{"$f":"IF(Table24[[#This Row],[Type Here]]=\"\",\"\",IF(Table24[[#This Row],[Type Here]]=Table24[[#This Row],[Answer]],1,-2))","v":""},{"$f":"IF($K$1=1,Table24[[#This Row],[Strength1]],Table24[[#This Row],[Strength2]])","v":5},{"$f":"IF($K$1=1,D640,G640)","v":"wood"},null,{"$f":"IF($K$1=1,IF(E640=\"\",\"\",E640),IF(H640=\"\",\"\",H640))","v":""},{"$f":"IF($K$1=1,G640,D640)","v":"das Holz"}]
[null,"05-Animals",{"$f":"IF(AND(LEFT(D641,1)=\"d\",MID(D641,4,1)=\" \"),RIGHT(D641,LEN(D641)-4),D641)","v":"Bär"},"der Bär",null,0,"bear",null,1,{"$f":"RAND()","v":0.8544162316765148},{"$f":"IF(Table24[[#This Row],[Type Here]]=\"\",\"\",IF(Table24[[#This Row],[Type Here]]=Table24[[#This Row],[Answer]],1,-2))","v":""},{"$f":"IF($K$1=1,Table24[[#This Row],[Strength1]],Table24[[#This Row],[Strength2]])","v":1},{"$f":"IF($K$1=1,D641,G641)","v":"bear"},null,{"$f":"IF($K$1=1,IF(E641=\"\",\"\",E641),IF(H641=\"\",\"\",H641))","v":""},{"$f":"IF($K$1=1,G641,D641)","v":"der Bär"}]
[null,"01-Basics 1",{"$f":"IF(AND(LEFT(D642,1)=\"d\",MID(D642,4,1)=\" \"),RIGHT(D642,LEN(D642)-4),D642)","v":"er ist"},"er ist",null,0,"he is",null,0,{"$f":"RAND()","v":0.955028550957312},{"$f":"IF(Table24[[#This Row],[Type Here]]=\"\",\"\",IF(Table24[[#This Row],[Type Here]]=Table24[[#This Row],[Answer]],1,-2))","v":""},{"$f":"IF($K$1=1,Table24[[#This Row],[Strength1]],Table24[[#This Row],[Strength2]])","v":0},{"$f":"IF($K$1=1,D642,G642)","v":"he is"},null,{"$f":"IF($K$1=1,IF(E642=\"\",\"\",E642),IF(H642=\"\",\"\",H642))","v":""},{"$f":"IF($K$1=1,G642,D642)","v":"er ist"}]
[null,"09-Clothing",{"$f":"IF(AND(LEFT(D643,1)=\"d\",MID(D643,4,1)=\" \"),RIGHT(D643,LEN(D643)-4),D643)","v":"Kleidung"},"die Kleidung",null,0,"clothing",null,1,{"$f":"RAND()","v":0.3109063582562386},{"$f":"IF(Table24[[#This Row],[Type Here]]=\"\",\"\",IF(Table24[[#This Row],[Type Here]]=Table24[[#This Row],[Answer]],1,-2))","v":""},{"$f":"IF($K$1=1,Table24[[#This Row],[Strength1]],Table24[[#This Row],[Strength2]])","v":1},{"$f":"IF($K$1=1,D643,G643)","v":"clothing"},null,{"$f":"IF($K$1=1,IF(E643=\"\",\"\",E643),IF(H643=\"\",\"\",H643))","v":""},{"$f":"IF($K$1=1,G643,D643)","v":"die Kleidung"}]
[null,"14-Household",{"$f":"IF(AND(LEFT(D644,1)=\"d\",MID(D644,4,1)=\" \"),RIGHT(D644,LEN(D644)-4),D644)","v":"Stuhl"},"der Stuhl",null,0,"chair",null,2,{"$f":"RAND()","v":0.9982015803041624},{"$f":"IF(Table24[[#This Row],[Type Here]]=\"\",\"\",IF(Table24[[#This Row],[Type Here]]=Table24[[#This Row],[Answer]],1,-2))","v":""},{"$f":"IF($K$1=1,Table24[[#This Row],[Strength1]],Table24[[#This Row],[Strength2]])","v":2},{"$f":"IF($K$1=1,D644,G644)","v":"chair"},null,{"$f":"IF($K$1=1,IF(E644=\"\",\"\",E644),IF(H644=\"\",\"\",H644))","v":""},{"$f":"IF($K$1=1,G644,D644)","v":"der Stuhl"}]
[null,"40-Places",{"$f":"IF(AND(LEFT(D645,1)=\"d\",MID(D645,4,1)=\" \"),RIGHT(D645,LEN(D645)-4),D645)","v":"Bundesländer"},"die Bundesländer",null,0,"states","federal states",-2,{"$f":"RAND()","v":0.8544002948636891},{"$f":"IF(Table24[[#This Row],[Type Here]]=\"\",\"\",IF(Table24[[#This Row],[Type Here]]=Table24[[#This Row],[Answer]],1,-2))","v":""},{"$f":"IF($K$1=1,Table24[[#This Row],[Strength1]],Table24[[#This Row],[Strength2]])","v":-2},{"$f":"IF($K$1=1,D645,G645)","v":"states"},null,{"$f":"IF($K$1=1,IF(E645=\"\",\"\",E645),IF(H645=\"\",\"\",H645))","v":"federal states"},{"$f":"IF($K$1=1,G645,D645)","v":"die Bundesländer"}]
[null,"40-Places",{"$f":"IF(AND(LEFT(D646,1)=\"d\",MID(D646,4,1)=\" \"),RIGHT(D646,LEN(D646)-4),D646)","v":"Landkreise"},"die Landkreise",null,0,"administrative districts",null,-2,{"$f":"RAND()","v":0.5311310248063003},{"$f":"IF(Table24[[#This Row],[Type Here]]=\"\",\"\",IF(Table24[[#This Row],[Type Here]]=Table24[[#This Row],[Answer]],1,-2))","v":""},{"$f":"IF($K$1=1,Table24[[#This Row],[Strength1]],Table24[[#This Row],[Strength2]])","v":-2},{"$f":"IF($K$1=1,D646,G646)","v":"administrative districts"},null,{"$f":"IF($K$1=1,IF(E646=\"\",\"\",E646),IF(H646=\"\",\"\",H646))","v":""},{"$f":"IF($K$1=1,G646,D646)","v":"die Landkreise"}]
[null,"39-Adj: Acc.",{"$f":"IF(AND(LEFT(D647,1)=\"d\",MID(D647,4,1)=\" \"),RIGHT(D647,LEN(D647)-4),D647)","v":"persönlich"},"persönlich",null,0,"personal",null,10,{"$f":"RAND()","v":0.9379541826483896},{"$f":"IF(Table24[[#This Row],[Type Here]]=\"\",\"\",IF(Table24[[#This Row],[Type Here]]=Table24[[#This Row],[Answer]],1,-2))","v":""},{"$f":"IF($K$1=1,Table24[[#This Row],[Strength1]],Table24[[#This Row],[Strength2]])","v":10},{"$f":"IF($K$1=1,D647,G647)","v":"personal"},null,{"$f":"IF($K$1=1,IF(E647=\"\",\"\",E647),IF(H647=\"\",\"\",H647))","v":""},{"$f":"IF($K$1=1,G647,D647)","v":"persönlich"}]
[null,"01-Basics 1",{"$f":"IF(AND(LEFT(D648,1)=\"d\",MID(D648,4,1)=\" \"),RIGHT(D648,LEN(D648)-4),D648)","v":"den"},"den","(article - Dat plural)",0,"the","Dat plural",0,{"$f":"RAND()","v":0.5152744535683775},{"$f":"IF(Table24[[#This Row],[Type Here]]=\"\",\"\",IF(Table24[[#This Row],[Type Here]]=Table24[[#This Row],[Answer]],1,-2))","v":""},{"$f":"IF($K$1=1,Table24[[#This Row],[Strength1]],Table24[[#This Row],[Strength2]])","v":0},{"$f":"IF($K$1=1,D648,G648)","v":"the"},null,{"$f":"IF($K$1=1,IF(E648=\"\",\"\",E648),IF(H648=\"\",\"\",H648))","v":"Dat plural"},{"$f":"IF($K$1=1,G648,D648)","v":"den"}]
[null,"40-Places",{"$f":"IF(AND(LEFT(D649,1)=\"d\",MID(D649,4,1)=\" \"),RIGHT(D649,LEN(D649)-4),D649)","v":"Flughafen"},"der Flughafen",null,0,"airport",null,-6,{"$f":"RAND()","v":0.4320119548857888},{"$f":"IF(Table24[[#This Row],[Type Here]]=\"\",\"\",IF(Table24[[#This Row],[Type Here]]=Table24[[#This Row],[Answer]],1,-2))","v":""},{"$f":"IF($K$1=1,Table24[[#This Row],[Strength1]],Table24[[#This Row],[Strength2]])","v":-6},{"$f":"IF($K$1=1,D649,G649)","v":"airport"},null,{"$f":"IF($K$1=1,IF(E649=\"\",\"\",E649),IF(H649=\"\",\"\",H649))","v":""},{"$f":"IF($K$1=1,G649,D649)","v":"der Flughafen"}]
[null,"01-Basics 1",{"$f":"IF(AND(LEFT(D650,1)=\"d\",MID(D650,4,1)=\" \"),RIGHT(D650,LEN(D650)-4),D650)","v":"Brot"},"das Brot",null,0,"bread","(noun)",1,{"$f":"RAND()","v":0.7882949077550169},{"$f":"IF(Table24[[#This Row],[Type Here]]=\"\",\"\",IF(Table24[[#This Row],[Type Here]]=Table24[[#This Row],[Answer]],1,-2))","v":""},{"$f":"IF($K$1=1,Table24[[#This Row],[Strength1]],Table24[[#This Row],[Strength2]])","v":1},{"$f":"IF($K$1=1,D650,G650)","v":"bread"},null,{"$f":"IF($K$1=1,IF(E650=\"\",\"\",E650),IF(H650=\"\",\"\",H650))","v":"(noun)"},{"$f":"IF($K$1=1,G650,D650)","v":"das Brot"}]
[null,"29-Medical",{"$f":"IF(AND(LEFT(D651,1)=\"d\",MID(D651,4,1)=\" \"),RIGHT(D651,LEN(D651)-4),D651)","v":"Ernährung"},"die Ernährung",null,0,"nutrition",null,-1,{"$f":"RAND()","v":0.18208439049149538},{"$f":"IF(Table24[[#This Row],[Type Here]]=\"\",\"\",IF(Table24[[#This Row],[Type Here]]=Table24[[#This Row],[Answer]],1,-2))","v":""},{"$f":"IF($K$1=1,Table24[[#This Row],[Strength1]],Table24[[#This Row],[Strength2]])","v":-1},{"$f":"IF($K$1=1,D651,G651)","v":"nutrition"},null,{"$f":"IF($K$1=1,IF(E651=\"\",\"\",E651),IF(H651=\"\",\"\",H651))","v":""},{"$f":"IF($K$1=1,G651,D651)","v":"die Ernährung"}]
[null,"29-Medical",{"$f":"IF(AND(LEFT(D652,1)=\"d\",MID(D652,4,1)=\" \"),RIGHT(D652,LEN(D652)-4),D652)","v":"Medikament"},"das Medikament",null,0,"medication",null,1,{"$f":"RAND()","v":0.49792325370825774},{"$f":"IF(Table24[[#This Row],[Type Here]]=\"\",\"\",IF(Table24[[#This Row],[Type Here]]=Table24[[#This Row],[Answer]],1,-2))","v":""},{"$f":"IF($K$1=1,Table24[[#This Row],[Strength1]],Table24[[#This Row],[Strength2]])","v":1},{"$f":"IF($K$1=1,D652,G652)","v":"medication"},null,{"$f":"IF($K$1=1,IF(E652=\"\",\"\",E652),IF(H652=\"\",\"\",H652))","v":""},{"$f":"IF($K$1=1,G652,D652)","v":"das Medikament"}]
[null,"36-Nature",{"$f":"IF(AND(LEFT(D653,1)=\"d\",MID(D653,4,1)=\" \"),RIGHT(D653,LEN(D653)-4),D653)","v":"Atmosphäre"},"die Atmosphäre",null,0,"atmosphere",null,6,{"$f":"RAND()","v":0.24134582699784013},{"$f":"IF(Table24[[#This Row],[Type Here]]=\"\",\"\",IF(Table24[[#This Row],[Type Here]]=Table24[[#This Row],[Answer]],1,-2))","v":""},{"$f":"IF($K$1=1,Table24[[#This Row],[Strength1]],Table24[[#This Row],[Strength2]])","v":6},{"$f":"IF($K$1=1,D653,G653)","v":"atmosphere"},null,{"$f":"IF($K$1=1,IF(E653=\"\",\"\",E653),IF(H653=\"\",\"\",H653))","v":""},{"$f":"IF($K$1=1,G653,D653)","v":"die Atmosphäre"}]
[null,"36-Nature",{"$f":"IF(AND(LEFT(D654,1)=\"d\",MID(D654,4,1)=\" \"),RIGHT(D654,LEN(D654)-4),D654)","v":"Seen"},"die Seen",null,0,"lakes",null,6,{"$f":"RAND()","v":0.05313448941997456},{"$f":"IF(Table24[[#This Row],[Type Here]]=\"\",\"\",IF(Table24[[#This Row],[Type Here]]=Table24[[#This Row],[Answer]],1,-2))","v":""},{"$f":"IF($K$1=1,Table24[[#This Row],[Strength1]],Table24[[#This Row],[Strength2]])","v":6},{"$f":"IF($K$1=1,D654,G654)","v":"lakes"},null,{"$f":"IF($K$1=1,IF(E654=\"\",\"\",E654),IF(H654=\"\",\"\",H654))","v":""},{"$f":"IF($K$1=1,G654,D654)","v":"die Seen"}]
[null,"39-Adj: Acc.",{"$f":"IF(AND(LEFT(D655,1)=\"d\",MID(D655,4,1)=\" \"),RIGHT(D655,LEN(D655)-4),D655)","v":"offen"},"offen",null,0,"open",null,10,{"$f":"RAND()","v":0.1894478182881859},{"$f":"IF(Table24[[#This Row],[Type Here]]=\"\",\"\",IF(Table24[[#This Row],[Type Here]]=Table24[[#This Row],[Answer]],1,-2))","v":""},{"$f":"IF($K$1=1,Table24[[#This Row],[Strength1]],Table24[[#This Row],[Strength2]])","v":10},{"$f":"IF($K$1=1,D655,G655)","v":"open"},null,{"$f":"IF($K$1=1,IF(E655=\"\",\"\",E655),IF(H655=\"\",\"\",H655))","v":""},{"$f":"IF($K$1=1,G655,D655)","v":"offen"}]
[null,"40-Places",{"$f":"IF(AND(LEFT(D656,1)=\"d\",MID(D656,4,1)=\" \"),RIGHT(D656,LEN(D656)-4),D656)","v":"Grund"},"der Grund",null,0,"ground","(also reason, basis)",0,{"$f":"RAND()","v":0.9619853768538366},{"$f":"IF(Table24[[#This Row],[Type Here]]=\"\",\"\",IF(Table24[[#This Row],[Type Here]]=Table24[[#This Row],[Answer]],1,-2))","v":""},{"$f":"IF($K$1=1,Table24[[#This Row],[Strength1]],Table24[[#This Row],[Strength2]])","v":0},{"$f":"IF($K$1=1,D656,G656)","v":"ground"},null,{"$f":"IF($K$1=1,IF(E656=\"\",\"\",E656),IF(H656=\"\",\"\",H656))","v":"(also reason, basis)"},{"$f":"IF($K$1=1,G656,D656)","v":"der Grund"}]
[null,"02-Basics 2",{"$f":"IF(AND(LEFT(D657,1)=\"d\",MID(D657,4,1)=\" \"),RIGHT(D657,LEN(D657)-4),D657)","v":"ich lese"},"ich lese",null,0,"I read",null,0,{"$f":"RAND()","v":0.6946496432068594},{"$f":"IF(Table24[[#This Row],[Type Here]]=\"\",\"\",IF(Table24[[#This Row],[Type Here]]=Table24[[#This Row],[Answer]],1,-2))","v":""},{"$f":"IF($K$1=1,Table24[[#This Row],[Strength1]],Table24[[#This Row],[Strength2]])","v":0},{"$f":"IF($K$1=1,D657,G657)","v":"I read"},null,{"$f":"IF($K$1=1,IF(E657=\"\",\"\",E657),IF(H657=\"\",\"\",H657))","v":""},{"$f":"IF($K$1=1,G657,D657)","v":"ich lese"}]
[null,"33-Adverbs 1",{"$f":"IF(AND(LEFT(D658,1)=\"d\",MID(D658,4,1)=\" \"),RIGHT(D658,LEN(D658)-4),D658)","v":"Zeitschriften"},"die Zeitschriften",null,0,"magazines",null,0,{"$f":"RAND()","v":0.7081485887285028},{"$f":"IF(Table24[[#This Row],[Type Here]]=\"\",\"\",IF(Table24[[#This Row],[Type Here]]=Table24[[#This Row],[Answer]],1,-2))","v":""},{"$f":"IF($K$1=1,Table24[[#This Row],[Strength1]],Table24[[#This Row],[Strength2]])","v":0},{"$f":"IF($K$1=1,D658,G658)","v":"magazines"},null,{"$f":"IF($K$1=1,IF(E658=\"\",\"\",E658),IF(H658=\"\",\"\",H658))","v":""},{"$f":"IF($K$1=1,G658,D658)","v":"die Zeitschriften"}]
[null,"14-Household",{"$f":"IF(AND(LEFT(D659,1)=\"d\",MID(D659,4,1)=\" \"),RIGHT(D659,LEN(D659)-4),D659)","v":"Sofas"},"die Sofas",null,0,"sofas",null,0,{"$f":"RAND()","v":0.8639940318506837},{"$f":"IF(Table24[[#This Row],[Type Here]]=\"\",\"\",IF(Table24[[#This Row],[Type Here]]=Table24[[#This Row],[Answer]],1,-2))","v":""},{"$f":"IF($K$1=1,Table24[[#This Row],[Strength1]],Table24[[#This Row],[Strength2]])","v":0},{"$f":"IF($K$1=1,D659,G659)","v":"sofas"},null,{"$f":"IF($K$1=1,IF(E659=\"\",\"\",E659),IF(H659=\"\",\"\",H659))","v":""},{"$f":"IF($K$1=1,G659,D659)","v":"die Sofas"}]
[null,"36-Nature",{"$f":"IF(AND(LEFT(D660,1)=\"d\",MID(D660,4,1)=\" \"),RIGHT(D660,LEN(D660)-4),D660)","v":"Natur"},"die Natur","(environment)",0,"nature",null,6,{"$f":"RAND()","v":0.028273083228398832},{"$f":"IF(Table24[[#This Row],[Type Here]]=\"\",\"\",IF(Table24[[#This Row],[Type Here]]=Table24[[#This Row],[Answer]],1,-2))","v":""},{"$f":"IF($K$1=1,Table24[[#This Row],[Strength1]],Table24[[#This Row],[Strength2]])","v":6},{"$f":"IF($K$1=1,D660,G660)","v":"nature"},null,{"$f":"IF($K$1=1,IF(E660=\"\",\"\",E660),IF(H660=\"\",\"\",H660))","v":""},{"$f":"IF($K$1=1,G660,D660)","v":"die Natur"}]
[null,"38-Ad: Nom. 1",{"$f":"IF(AND(LEFT(D661,1)=\"d\",MID(D661,4,1)=\" \"),RIGHT(D661,LEN(D661)-4),D661)","v":"höher"},"höher",null,0,"higher",null,3,{"$f":"RAND()","v":0.5165373782623806},{"$f":"IF(Table24[[#This Row],[Type Here]]=\"\",\"\",IF(Table24[[#This Row],[Type Here]]=Table24[[#This Row],[Answer]],1,-2))","v":""},{"$f":"IF($K$1=1,Table24[[#This Row],[Strength1]],Table24[[#This Row],[Strength2]])","v":3},{"$f":"IF($K$1=1,D661,G661)","v":"higher"},null,{"$f":"IF($K$1=1,IF(E661=\"\",\"\",E661),IF(H661=\"\",\"\",H661))","v":""},{"$f":"IF($K$1=1,G661,D661)","v":"höher"}]
[null,"09-Clothing",{"$f":"IF(AND(LEFT(D662,1)=\"d\",MID(D662,4,1)=\" \"),RIGHT(D662,LEN(D662)-4),D662)","v":"Schmuck"},"der Schmuck",null,0,"jewelry",null,1,{"$f":"RAND()","v":0.8461628262047817},{"$f":"IF(Table24[[#This Row],[Type Here]]=\"\",\"\",IF(Table24[[#This Row],[Type Here]]=Table24[[#This Row],[Answer]],1,-2))","v":""},{"$f":"IF($K$1=1,Table24[[#This Row],[Strength1]],Table24[[#This Row],[Strength2]])","v":1},{"$f":"IF($K$1=1,D662,G662)","v":"jewelry"},null,{"$f":"IF($K$1=1,IF(E662=\"\",\"\",E662),IF(H662=\"\",\"\",H662))","v":""},{"$f":"IF($K$1=1,G662,D662)","v":"der Schmuck"}]
[null,"07-Adjectives",{"$f":"IF(AND(LEFT(D663,1)=\"d\",MID(D663,4,1)=\" \"),RIGHT(D663,LEN(D663)-4),D663)","v":"wichtig"},"wichtig",null,0,"important",null,3,{"$f":"RAND()","v":0.21488464570588295},{"$f":"IF(Table24[[#This Row],[Type Here]]=\"\",\"\",IF(Table24[[#This Row],[Type Here]]=Table24[[#This Row],[Answer]],1,-2))","v":""},{"$f":"IF($K$1=1,Table24[[#This Row],[Strength1]],Table24[[#This Row],[Strength2]])","v":3},{"$f":"IF($K$1=1,D663,G663)","v":"important"},null,{"$f":"IF($K$1=1,IF(E663=\"\",\"\",E663),IF(H663=\"\",\"\",H663))","v":""},{"$f":"IF($K$1=1,G663,D663)","v":"wichtig"}]
[null,"40-Places",{"$f":"IF(AND(LEFT(D664,1)=\"d\",MID(D664,4,1)=\" \"),RIGHT(D664,LEN(D664)-4),D664)","v":"Land"},"das Land",null,0,"country","land",3,{"$f":"RAND()","v":0.026490200700542088},{"$f":"IF(Table24[[#This Row],[Type Here]]=\"\",\"\",IF(Table24[[#This Row],[Type Here]]=Table24[[#This Row],[Answer]],1,-2))","v":""},{"$f":"IF($K$1=1,Table24[[#This Row],[Strength1]],Table24[[#This Row],[Strength2]])","v":3},{"$f":"IF($K$1=1,D664,G664)","v":"country"},null,{"$f":"IF($K$1=1,IF(E664=\"\",\"\",E664),IF(H664=\"\",\"\",H664))","v":"land"},{"$f":"IF($K$1=1,G664,D664)","v":"das Land"}]
[null,"02-Basics 2",{"$f":"IF(AND(LEFT(D665,1)=\"d\",MID(D665,4,1)=\" \"),RIGHT(D665,LEN(D665)-4),D665)","v":"wir"},"wir",null,0,"we",null,0,{"$f":"RAND()","v":0.9631369164149332},{"$f":"IF(Table24[[#This Row],[Type Here]]=\"\",\"\",IF(Table24[[#This Row],[Type Here]]=Table24[[#This Row],[Answer]],1,-2))","v":""},{"$f":"IF($K$1=1,Table24[[#This Row],[Strength1]],Table24[[#This Row],[Strength2]])","v":0},{"$f":"IF($K$1=1,D665,G665)","v":"we"},null,{"$f":"IF($K$1=1,IF(E665=\"\",\"\",E665),IF(H665=\"\",\"\",H665))","v":""},{"$f":"IF($K$1=1,G665,D665)","v":"wir"}]
[null,"04-Food",{"$f":"IF(AND(LEFT(D666,1)=\"d\",MID(D666,4,1)=\" \"),RIGHT(D666,LEN(D666)-4),D666)","v":"Salze"},"die Salze",null,0,"salts","noun",0,{"$f":"RAND()","v":0.992211560800868},{"$f":"IF(Table24[[#This Row],[Type Here]]=\"\",\"\",IF(Table24[[#This Row],[Type Here]]=Table24[[#This Row],[Answer]],1,-2))","v":""},{"$f":"IF($K$1=1,Table24[[#This Row],[Strength1]],Table24[[#This Row],[Strength2]])","v":0},{"$f":"IF($K$1=1,D666,G666)","v":"salts"},null,{"$f":"IF($K$1=1,IF(E666=\"\",\"\",E666),IF(H666=\"\",\"\",H666))","v":"noun"},{"$f":"IF($K$1=1,G666,D666)","v":"die Salze"}]
[null,"38-Ad: Nom. 1",{"$f":"IF(AND(LEFT(D667,1)=\"d\",MID(D667,4,1)=\" \"),RIGHT(D667,LEN(D667)-4),D667)","v":"gesamt"},"gesamt",null,0,"whole","(entire, total)",3,{"$f":"RAND()","v":0.17989733920066242},{"$f":"IF(Table24[[#This Row],[Type Here]]=\"\",\"\",IF(Table24[[#This Row],[Type Here]]=Table24[[#This Row],[Answer]],1,-2))","v":""},{"$f":"IF($K$1=1,Table24[[#This Row],[Strength1]],Table24[[#This Row],[Strength2]])","v":3},{"$f":"IF($K$1=1,D667,G667)","v":"whole"},null,{"$f":"IF($K$1=1,IF(E667=\"\",\"\",E667),IF(H667=\"\",\"\",H667))","v":"(entire, total)"},{"$f":"IF($K$1=1,G667,D667)","v":"gesamt"}]
[null,"33-Adverbs 1",{"$f":"IF(AND(LEFT(D668,1)=\"d\",MID(D668,4,1)=\" \"),RIGHT(D668,LEN(D668)-4),D668)","v":"so"},"so",null,0,"so",null,0,{"$f":"RAND()","v":0.3588094710837081},{"$f":"IF(Table24[[#This Row],[Type Here]]=\"\",\"\",IF(Table24[[#This Row],[Type Here]]=Table24[[#This Row],[Answer]],1,-2))","v":""},{"$f":"IF($K$1=1,Table24[[#This Row],[Strength1]],Table24[[#This Row],[Strength2]])","v":0},{"$f":"IF($K$1=1,D668,G668)","v":"so"},null,{"$f":"IF($K$1=1,IF(E668=\"\",\"\",E668),IF(H668=\"\",\"\",H668))","v":""},{"$f":"IF($K$1=1,G668,D668)","v":"so"}]
[null,"11-Family",{"$f":"IF(AND(LEFT(D669,1)=\"d\",MID(D669,4,1)=\" \"),RIGHT(D669,LEN(D669)-4),D669)","v":"Töchter"},"die Töchter",null,null,"daughters",null,null,{"$f":"RAND()","v":0.1923157744412871},{"$f":"IF(Table24[[#This Row],[Type Here]]=\"\",\"\",IF(Table24[[#This Row],[Type Here]]=Table24[[#This Row],[Answer]],1,-2))","v":""},{"$f":"IF($K$1=1,Table24[[#This Row],[Strength1]],Table24[[#This Row],[Strength2]])","v":0},{"$f":"IF($K$1=1,D669,G669)","v":"daughters"},null,{"$f":"IF($K$1=1,IF(E669=\"\",\"\",E669),IF(H669=\"\",\"\",H669))","v":""},{"$f":"IF($K$1=1,G669,D669)","v":"die Töchter"}]
[null,"29-Medical",{"$f":"IF(AND(LEFT(D670,1)=\"d\",MID(D670,4,1)=\" \"),RIGHT(D670,LEN(D670)-4),D670)","v":"Opfer"},"das Opfer",null,0,"victim",null,3,{"$f":"RAND()","v":0.01993468527039388},{"$f":"IF(Table24[[#This Row],[Type Here]]=\"\",\"\",IF(Table24[[#This Row],[Type Here]]=Table24[[#This Row],[Answer]],1,-2))","v":""},{"$f":"IF($K$1=1,Table24[[#This Row],[Strength1]],Table24[[#This Row],[Strength2]])","v":3},{"$f":"IF($K$1=1,D670,G670)","v":"victim"},null,{"$f":"IF($K$1=1,IF(E670=\"\",\"\",E670),IF(H670=\"\",\"\",H670))","v":""},{"$f":"IF($K$1=1,G670,D670)","v":"das Opfer"}]
[null,"39-Adj: Acc.",{"$f":"IF(AND(LEFT(D671,1)=\"d\",MID(D671,4,1)=\" \"),RIGHT(D671,LEN(D671)-4),D671)","v":"detailliert"},"detailliert",null,0,"detailed",null,7,{"$f":"RAND()","v":0.3059249600571462},{"$f":"IF(Table24[[#This Row],[Type Here]]=\"\",\"\",IF(Table24[[#This Row],[Type Here]]=Table24[[#This Row],[Answer]],1,-2))","v":""},{"$f":"IF($K$1=1,Table24[[#This Row],[Strength1]],Table24[[#This Row],[Strength2]])","v":7},{"$f":"IF($K$1=1,D671,G671)","v":"detailed"},null,{"$f":"IF($K$1=1,IF(E671=\"\",\"\",E671),IF(H671=\"\",\"\",H671))","v":""},{"$f":"IF($K$1=1,G671,D671)","v":"detailliert"}]
[null,"40-Places",{"$f":"IF(AND(LEFT(D672,1)=\"d\",MID(D672,4,1)=\" \"),RIGHT(D672,LEN(D672)-4),D672)","v":"Bars"},"die Bars",null,0,"bars","(nightclubs)",2,{"$f":"RAND()","v":0.4549600645558952},{"$f":"IF(Table24[[#This Row],[Type Here]]=\"\",\"\",IF(Table24[[#This Row],[Type Here]]=Table24[[#This Row],[Answer]],1,-2))","v":""},{"$f":"IF($K$1=1,Table24[[#This Row],[Strength1]],Table24[[#This Row],[Strength2]])","v":2},{"$f":"IF($K$1=1,D672,G672)","v":"bars"},null,{"$f":"IF($K$1=1,IF(E672=\"\",\"\",E672),IF(H672=\"\",\"\",H672))","v":"(nightclubs)"},{"$f":"IF($K$1=1,G672,D672)","v":"die Bars"}]
[null,"14-Household",{"$f":"IF(AND(LEFT(D673,1)=\"d\",MID(D673,4,1)=\" \"),RIGHT(D673,LEN(D673)-4),D673)","v":"Batterien"},"die Batterien",null,0,"batteries",null,-2,{"$f":"RAND()","v":0.8642515008181979},{"$f":"IF(Table24[[#This Row],[Type Here]]=\"\",\"\",IF(Table24[[#This Row],[Type Here]]=Table24[[#This Row],[Answer]],1,-2))","v":""},{"$f":"IF($K$1=1,Table24[[#This Row],[Strength1]],Table24[[#This Row],[Strength2]])","v":-2},{"$f":"IF($K$1=1,D673,G673)","v":"batteries"},null,{"$f":"IF($K$1=1,IF(E673=\"\",\"\",E673),IF(H673=\"\",\"\",H673))","v":""},{"$f":"IF($K$1=1,G673,D673)","v":"die Batterien"}]
[null,"36-Nature",{"$f":"IF(AND(LEFT(D674,1)=\"d\",MID(D674,4,1)=\" \"),RIGHT(D674,LEN(D674)-4),D674)","v":"Wetter"},"das Wetter",null,0,"weather",null,6,{"$f":"RAND()","v":0.8673859472247989},{"$f":"IF(Table24[[#This Row],[Type Here]]=\"\",\"\",IF(Table24[[#This Row],[Type Here]]=Table24[[#This Row],[Answer]],1,-2))","v":""},{"$f":"IF($K$1=1,Table24[[#This Row],[Strength1]],Table24[[#This Row],[Strength2]])","v":6},{"$f":"IF($K$1=1,D674,G674)","v":"weather"},null,{"$f":"IF($K$1=1,IF(E674=\"\",\"\",E674),IF(H674=\"\",\"\",H674))","v":""},{"$f":"IF($K$1=1,G674,D674)","v":"das Wetter"}]
[null,"06-Plurals",{"$f":"IF(AND(LEFT(D675,1)=\"d\",MID(D675,4,1)=\" \"),RIGHT(D675,LEN(D675)-4),D675)","v":"Tomaten"},"die Tomaten",null,0,"tomatoes",null,3,{"$f":"RAND()","v":0.6250581570720961},{"$f":"IF(Table24[[#This Row],[Type Here]]=\"\",\"\",IF(Table24[[#This Row],[Type Here]]=Table24[[#This Row],[Answer]],1,-2))","v":""},{"$f":"IF($K$1=1,Table24[[#This Row],[Strength1]],Table24[[#This Row],[Strength2]])","v":3},{"$f":"IF($K$1=1,D675,G675)","v":"tomatoes"},null,{"$f":"IF($K$1=1,IF(E675=\"\",\"\",E675),IF(H675=\"\",\"\",H675))","v":""},{"$f":"IF($K$1=1,G675,D675)","v":"die Tomaten"}]
[null,"22-Colors",{"$f":"IF(AND(LEFT(D676,1)=\"d\",MID(D676,4,1)=\" \"),RIGHT(D676,LEN(D676)-4),D676)","v":"rot"},"rot",null,0,"red",null,1,{"$f":"RAND()","v":0.4835150567170292},{"$f":"IF(Table24[[#This Row],[Type Here]]=\"\",\"\",IF(Table24[[#This Row],[Type Here]]=Table24[[#This Row],[Answer]],1,-2))","v":""},{"$f":"IF($K$1=1,Table24[[#This Row],[Strength1]],Table24[[#This Row],[Strength2]])","v":1},{"$f":"IF($K$1=1,D676,G676)","v":"red"},null,{"$f":"IF($K$1=1,IF(E676=\"\",\"\",E676),IF(H676=\"\",\"\",H676))","v":""},{"$f":"IF($K$1=1,G676,D676)","v":"rot"}]
[null,"40-Places",{"$f":"IF(AND(LEFT(D677,1)=\"d\",MID(D677,4,1)=\" \"),RIGHT(D677,LEN(D677)-4),D677)","v":"Ferienhäuser"},"die Ferienhäuser",null,0,"vacation homes",null,0,{"$f":"RAND()","v":0.4060869101090734},{"$f":"IF(Table24[[#This Row],[Type Here]]=\"\",\"\",IF(Table24[[#This Row],[Type Here]]=Table24[[#This Row],[Answer]],1,-2))","v":""},{"$f":"IF($K$1=1,Table24[[#This Row],[Strength1]],Table24[[#This Row],[Strength2]])","v":0},{"$f":"IF($K$1=1,D677,G677)","v":"vacation homes"},null,{"$f":"IF($K$1=1,IF(E677=\"\",\"\",E677),IF(H677=\"\",\"\",H677))","v":""},{"$f":"IF($K$1=1,G677,D677)","v":"die Ferienhäuser"}]
[null,"40-Places",{"$f":"IF(AND(LEFT(D678,1)=\"d\",MID(D678,4,1)=\" \"),RIGHT(D678,LEN(D678)-4),D678)","v":"Bar"},"die Bar",null,0,"bar","(nightclub)",-4,{"$f":"RAND()","v":0.2690496621318773},{"$f":"IF(Table24[[#This Row],[Type Here]]=\"\",\"\",IF(Table24[[#This Row],[Type Here]]=Table24[[#This Row],[Answer]],1,-2))","v":""},{"$f":"IF($K$1=1,Table24[[#This Row],[Strength1]],Table24[[#This Row],[Strength2]])","v":-4},{"$f":"IF($K$1=1,D678,G678)","v":"bar"},null,{"$f":"IF($K$1=1,IF(E678=\"\",\"\",E678),IF(H678=\"\",\"\",H678))","v":"(nightclub)"},{"$f":"IF($K$1=1,G678,D678)","v":"die Bar"}]
[null,"02-Basics 2",{"$f":"IF(AND(LEFT(D679,1)=\"d\",MID(D679,4,1)=\" \"),RIGHT(D679,LEN(D679)-4),D679)","v":"wir trinken"},"wir trinken",null,0,"we drink",null,1,{"$f":"RAND()","v":0.8057698310575907},{"$f":"IF(Table24[[#This Row],[Type Here]]=\"\",\"\",IF(Table24[[#This Row],[Type Here]]=Table24[[#This Row],[Answer]],1,-2))","v":""},{"$f":"IF($K$1=1,Table24[[#This Row],[Strength1]],Table24[[#This Row],[Strength2]])","v":1},{"$f":"IF($K$1=1,D679,G679)","v":"we drink"},null,{"$f":"IF($K$1=1,IF(E679=\"\",\"\",E679),IF(H679=\"\",\"\",H679))","v":""},{"$f":"IF($K$1=1,G679,D679)","v":"wir trinken"}]
[null,"29-Medical",{"$f":"IF(AND(LEFT(D680,1)=\"d\",MID(D680,4,1)=\" \"),RIGHT(D680,LEN(D680)-4),D680)","v":"bei der Geburt"},"bei der Geburt",null,0,"at birth",null,3,{"$f":"RAND()","v":0.2523388297723901},{"$f":"IF(Table24[[#This Row],[Type Here]]=\"\",\"\",IF(Table24[[#This Row],[Type Here]]=Table24[[#This Row],[Answer]],1,-2))","v":""},{"$f":"IF($K$1=1,Table24[[#This Row],[Strength1]],Table24[[#This Row],[Strength2]])","v":3},{"$f":"IF($K$1=1,D680,G680)","v":"at birth"},null,{"$f":"IF($K$1=1,IF(E680=\"\",\"\",E680),IF(H680=\"\",\"\",H680))","v":""},{"$f":"IF($K$1=1,G680,D680)","v":"bei der Geburt"}]
[null,"40-Places",{"$f":"IF(AND(LEFT(D681,1)=\"d\",MID(D681,4,1)=\" \"),RIGHT(D681,LEN(D681)-4),D681)","v":"Bereiche"},"die Bereiche",null,0,"areas","(regions, sectors(",-1,{"$f":"RAND()","v":0.6487575937492535},{"$f":"IF(Table24[[#This Row],[Type Here]]=\"\",\"\",IF(Table24[[#This Row],[Type Here]]=Table24[[#This Row],[Answer]],1,-2))","v":""},{"$f":"IF($K$1=1,Table24[[#This Row],[Strength1]],Table24[[#This Row],[Strength2]])","v":-1},{"$f":"IF($K$1=1,D681,G681)","v":"areas"},null,{"$f":"IF($K$1=1,IF(E681=\"\",\"\",E681),IF(H681=\"\",\"\",H681))","v":"(regions, sectors("},{"$f":"IF($K$1=1,G681,D681)","v":"die Bereiche"}]
[null,"33-Adverbs 1",{"$f":"IF(AND(LEFT(D682,1)=\"d\",MID(D682,4,1)=\" \"),RIGHT(D682,LEN(D682)-4),D682)","v":"sofort"},"sofort",null,0,"immediately",null,0,{"$f":"RAND()","v":0.3584848182000354},{"$f":"IF(Table24[[#This Row],[Type Here]]=\"\",\"\",IF(Table24[[#This Row],[Type Here]]=Table24[[#This Row],[Answer]],1,-2))","v":""},{"$f":"IF($K$1=1,Table24[[#This Row],[Strength1]],Table24[[#This Row],[Strength2]])","v":0},{"$f":"IF($K$1=1,D682,G682)","v":"immediately"},null,{"$f":"IF($K$1=1,IF(E682=\"\",\"\",E682),IF(H682=\"\",\"\",H682))","v":""},{"$f":"IF($K$1=1,G682,D682)","v":"sofort"}]
[null,"14-Household",{"$f":"IF(AND(LEFT(D683,1)=\"d\",MID(D683,4,1)=\" \"),RIGHT(D683,LEN(D683)-4),D683)","v":"Lampe"},"die Lampe",null,0,"lamp",null,1,{"$f":"RAND()","v":0.5859265481150754},{"$f":"IF(Table24[[#This Row],[Type Here]]=\"\",\"\",IF(Table24[[#This Row],[Type Here]]=Table24[[#This Row],[Answer]],1,-2))","v":""},{"$f":"IF($K$1=1,Table24[[#This Row],[Strength1]],Table24[[#This Row],[Strength2]])","v":1},{"$f":"IF($K$1=1,D683,G683)","v":"lamp"},null,{"$f":"IF($K$1=1,IF(E683=\"\",\"\",E683),IF(H683=\"\",\"\",H683))","v":""},{"$f":"IF($K$1=1,G683,D683)","v":"die Lampe"}]
[null,"40-Places",{"$f":"IF(AND(LEFT(D684,1)=\"d\",MID(D684,4,1)=\" \"),RIGHT(D684,LEN(D684)-4),D684)","v":"Dorf"},"das Dorf",null,0,"village",null,0,{"$f":"RAND()","v":0.17232350373442562},{"$f":"IF(Table24[[#This Row],[Type Here]]=\"\",\"\",IF(Table24[[#This Row],[Type Here]]=Table24[[#This Row],[Answer]],1,-2))","v":""},{"$f":"IF($K$1=1,Table24[[#This Row],[Strength1]],Table24[[#This Row],[Strength2]])","v":0},{"$f":"IF($K$1=1,D684,G684)","v":"village"},null,{"$f":"IF($K$1=1,IF(E684=\"\",\"\",E684),IF(H684=\"\",\"\",H684))","v":""},{"$f":"IF($K$1=1,G684,D684)","v":"das Dorf"}]
[null,"14-Household",{"$f":"IF(AND(LEFT(D685,1)=\"d\",MID(D685,4,1)=\" \"),RIGHT(D685,LEN(D685)-4),D685)","v":"Keller"},"die Keller",null,0,"cellars",null,0,{"$f":"RAND()","v":0.19944036028661083},{"$f":"IF(Table24[[#This Row],[Type Here]]=\"\",\"\",IF(Table24[[#This Row],[Type Here]]=Table24[[#This Row],[Answer]],1,-2))","v":""},{"$f":"IF($K$1=1,Table24[[#This Row],[Strength1]],Table24[[#This Row],[Strength2]])","v":0},{"$f":"IF($K$1=1,D685,G685)","v":"cellars"},null,{"$f":"IF($K$1=1,IF(E685=\"\",\"\",E685),IF(H685=\"\",\"\",H685))","v":""},{"$f":"IF($K$1=1,G685,D685)","v":"die Keller"}]
[null,"01-Basics 1",{"$f":"IF(AND(LEFT(D686,1)=\"d\",MID(D686,4,1)=\" \"),RIGHT(D686,LEN(D686)-4),D686)","v":"einen"},"einen","(article - Acc masc)",0,"a","Acc masc.",1,{"$f":"RAND()","v":0.6375880043027518},{"$f":"IF(Table24[[#This Row],[Type Here]]=\"\",\"\",IF(Table24[[#This Row],[Type Here]]=Table24[[#This Row],[Answer]],1,-2))","v":""},{"$f":"IF($K$1=1,Table24[[#This Row],[Strength1]],Table24[[#This Row],[Strength2]])","v":1},{"$f":"IF($K$1=1,D686,G686)","v":"a"},null,{"$f":"IF($K$1=1,IF(E686=\"\",\"\",E686),IF(H686=\"\",\"\",H686))","v":"Acc masc."},{"$f":"IF($K$1=1,G686,D686)","v":"einen"}]
[null,"04-Food",{"$f":"IF(AND(LEFT(D687,1)=\"d\",MID(D687,4,1)=\" \"),RIGHT(D687,LEN(D687)-4),D687)","v":"sie schmeckt"},"sie schmeckt",null,0,"she tastes",null,3,{"$f":"RAND()","v":0.23214160340576862},{"$f":"IF(Table24[[#This Row],[Type Here]]=\"\",\"\",IF(Table24[[#This Row],[Type Here]]=Table24[[#This Row],[Answer]],1,-2))","v":""},{"$f":"IF($K$1=1,Table24[[#This Row],[Strength1]],Table24[[#This Row],[Strength2]])","v":3},{"$f":"IF($K$1=1,D687,G687)","v":"she tastes"},null,{"$f":"IF($K$1=1,IF(E687=\"\",\"\",E687),IF(H687=\"\",\"\",H687))","v":""},{"$f":"IF($K$1=1,G687,D687)","v":"sie schmeckt"}]
[null,"39-Adj: Acc.",{"$f":"IF(AND(LEFT(D688,1)=\"d\",MID(D688,4,1)=\" \"),RIGHT(D688,LEN(D688)-4),D688)","v":"gleich"},"gleich",null,0,"like","(similar to)",10,{"$f":"RAND()","v":0.21033567682497611},{"$f":"IF(Table24[[#This Row],[Type Here]]=\"\",\"\",IF(Table24[[#This Row],[Type Here]]=Table24[[#This Row],[Answer]],1,-2))","v":""},{"$f":"IF($K$1=1,Table24[[#This Row],[Strength1]],Table24[[#This Row],[Strength2]])","v":10},{"$f":"IF($K$1=1,D688,G688)","v":"like"},null,{"$f":"IF($K$1=1,IF(E688=\"\",\"\",E688),IF(H688=\"\",\"\",H688))","v":"(similar to)"},{"$f":"IF($K$1=1,G688,D688)","v":"gleich"}]
[null,"04-Food",{"$f":"IF(AND(LEFT(D689,1)=\"d\",MID(D689,4,1)=\" \"),RIGHT(D689,LEN(D689)-4),D689)","v":"Gemüse"},"das Gemüse",null,0,"vegetable",null,1,{"$f":"RAND()","v":0.5112175344926786},{"$f":"IF(Table24[[#This Row],[Type Here]]=\"\",\"\",IF(Table24[[#This Row],[Type Here]]=Table24[[#This Row],[Answer]],1,-2))","v":""},{"$f":"IF($K$1=1,Table24[[#This Row],[Strength1]],Table24[[#This Row],[Strength2]])","v":1},{"$f":"IF($K$1=1,D689,G689)","v":"vegetable"},null,{"$f":"IF($K$1=1,IF(E689=\"\",\"\",E689),IF(H689=\"\",\"\",H689))","v":""},{"$f":"IF($K$1=1,G689,D689)","v":"das Gemüse"}]
[null,"36-Nature",{"$f":"IF(AND(LEFT(D690,1)=\"d\",MID(D690,4,1)=\" \"),RIGHT(D690,LEN(D690)-4),D690)","v":"Sonnen"},"die Sonnen",null,0,"suns",null,6,{"$f":"RAND()","v":0.9824494828375419},{"$f":"IF(Table24[[#This Row],[Type Here]]=\"\",\"\",IF(Table24[[#This Row],[Type Here]]=Table24[[#This Row],[Answer]],1,-2))","v":""},{"$f":"IF($K$1=1,Table24[[#This Row],[Strength1]],Table24[[#This Row],[Strength2]])","v":6},{"$f":"IF($K$1=1,D690,G690)","v":"suns"},null,{"$f":"IF($K$1=1,IF(E690=\"\",\"\",E690),IF(H690=\"\",\"\",H690))","v":""},{"$f":"IF($K$1=1,G690,D690)","v":"die Sonnen"}]
[null,"07-Adjectives",{"$f":"IF(AND(LEFT(D691,1)=\"d\",MID(D691,4,1)=\" \"),RIGHT(D691,LEN(D691)-4),D691)","v":"hoch"},"hoch",null,0,"high",null,0,{"$f":"RAND()","v":0.011897193114465687},{"$f":"IF(Table24[[#This Row],[Type Here]]=\"\",\"\",IF(Table24[[#This Row],[Type Here]]=Table24[[#This Row],[Answer]],1,-2))","v":""},{"$f":"IF($K$1=1,Table24[[#This Row],[Strength1]],Table24[[#This Row],[Strength2]])","v":0},{"$f":"IF($K$1=1,D691,G691)","v":"high"},null,{"$f":"IF($K$1=1,IF(E691=\"\",\"\",E691),IF(H691=\"\",\"\",H691))","v":""},{"$f":"IF($K$1=1,G691,D691)","v":"hoch"}]
[null,"33-Adverbs 1",{"$f":"IF(AND(LEFT(D692,1)=\"d\",MID(D692,4,1)=\" \"),RIGHT(D692,LEN(D692)-4),D692)","v":"genauso"},"genauso",null,0,"equally",null,-1,{"$f":"RAND()","v":0.883107155317874},{"$f":"IF(Table24[[#This Row],[Type Here]]=\"\",\"\",IF(Table24[[#This Row],[Type Here]]=Table24[[#This Row],[Answer]],1,-2))","v":""},{"$f":"IF($K$1=1,Table24[[#This Row],[Strength1]],Table24[[#This Row],[Strength2]])","v":-1},{"$f":"IF($K$1=1,D692,G692)","v":"equally"},null,{"$f":"IF($K$1=1,IF(E692=\"\",\"\",E692),IF(H692=\"\",\"\",H692))","v":""},{"$f":"IF($K$1=1,G692,D692)","v":"genauso"}]
[null,"14-Household",{"$f":"IF(AND(LEFT(D693,1)=\"d\",MID(D693,4,1)=\" \"),RIGHT(D693,LEN(D693)-4),D693)","v":"Leiter"},"die Leiter",null,0,"leaders","male",1,{"$f":"RAND()","v":0.9057740542206838},{"$f":"IF(Table24[[#This Row],[Type Here]]=\"\",\"\",IF(Table24[[#This Row],[Type Here]]=Table24[[#This Row],[Answer]],1,-2))","v":""},{"$f":"IF($K$1=1,Table24[[#This Row],[Strength1]],Table24[[#This Row],[Strength2]])","v":1},{"$f":"IF($K$1=1,D693,G693)","v":"leaders"},null,{"$f":"IF($K$1=1,IF(E693=\"\",\"\",E693),IF(H693=\"\",\"\",H693))","v":"male"},{"$f":"IF($K$1=1,G693,D693)","v":"die Leiter"}]
[null,"01-Basics 1",{"$f":"IF(AND(LEFT(D694,1)=\"d\",MID(D694,4,1)=\" \"),RIGHT(D694,LEN(D694)-4),D694)","v":"das"},"das","(article - Nom neut)",0,"the","Nom neut",0,{"$f":"RAND()","v":0.041583559258944636},{"$f":"IF(Table24[[#This Row],[Type Here]]=\"\",\"\",IF(Table24[[#This Row],[Type Here]]=Table24[[#This Row],[Answer]],1,-2))","v":""},{"$f":"IF($K$1=1,Table24[[#This Row],[Strength1]],Table24[[#This Row],[Strength2]])","v":0},{"$f":"IF($K$1=1,D694,G694)","v":"the"},null,{"$f":"IF($K$1=1,IF(E694=\"\",\"\",E694),IF(H694=\"\",\"\",H694))","v":"Nom neut"},{"$f":"IF($K$1=1,G694,D694)","v":"das"}]
[null,"40-Places",{"$f":"IF(AND(LEFT(D695,1)=\"d\",MID(D695,4,1)=\" \"),RIGHT(D695,LEN(D695)-4),D695)","v":"Länder"},"die Länder",null,0,"countries","lands",-2,{"$f":"RAND()","v":0.9195957790201791},{"$f":"IF(Table24[[#This Row],[Type Here]]=\"\",\"\",IF(Table24[[#This Row],[Type Here]]=Table24[[#This Row],[Answer]],1,-2))","v":""},{"$f":"IF($K$1=1,Table24[[#This Row],[Strength1]],Table24[[#This Row],[Strength2]])","v":-2},{"$f":"IF($K$1=1,D695,G695)","v":"countries"},null,{"$f":"IF($K$1=1,IF(E695=\"\",\"\",E695),IF(H695=\"\",\"\",H695))","v":"lands"},{"$f":"IF($K$1=1,G695,D695)","v":"die Länder"}]
[null,"09-Clothing",{"$f":"IF(AND(LEFT(D696,1)=\"d\",MID(D696,4,1)=\" \"),RIGHT(D696,LEN(D696)-4),D696)","v":"Hemd"},"das Hemd",null,0,"shirt",null,1,{"$f":"RAND()","v":0.5615614834978487},{"$f":"IF(Table24[[#This Row],[Type Here]]=\"\",\"\",IF(Table24[[#This Row],[Type Here]]=Table24[[#This Row],[Answer]],1,-2))","v":""},{"$f":"IF($K$1=1,Table24[[#This Row],[Strength1]],Table24[[#This Row],[Strength2]])","v":1},{"$f":"IF($K$1=1,D696,G696)","v":"shirt"},null,{"$f":"IF($K$1=1,IF(E696=\"\",\"\",E696),IF(H696=\"\",\"\",H696))","v":""},{"$f":"IF($K$1=1,G696,D696)","v":"das Hemd"}]
[null,"36-Nature",{"$f":"IF(AND(LEFT(D697,1)=\"d\",MID(D697,4,1)=\" \"),RIGHT(D697,LEN(D697)-4),D697)","v":"Berge"},"die Berge",null,0,"mountains",null,6,{"$f":"RAND()","v":0.2429208697669396},{"$f":"IF(Table24[[#This Row],[Type Here]]=\"\",\"\",IF(Table24[[#This Row],[Type Here]]=Table24[[#This Row],[Answer]],1,-2))","v":""},{"$f":"IF($K$1=1,Table24[[#This Row],[Strength1]],Table24[[#This Row],[Strength2]])","v":6},{"$f":"IF($K$1=1,D697,G697)","v":"mountains"},null,{"$f":"IF($K$1=1,IF(E697=\"\",\"\",E697),IF(H697=\"\",\"\",H697))","v":""},{"$f":"IF($K$1=1,G697,D697)","v":"die Berge"}]
[null,"40-Places",{"$f":"IF(AND(LEFT(D698,1)=\"d\",MID(D698,4,1)=\" \"),RIGHT(D698,LEN(D698)-4),D698)","v":"Landkreis"},"der Landkreis",null,0,"administrative district",null,-2,{"$f":"RAND()","v":0.8637211791202994},{"$f":"IF(Table24[[#This Row],[Type Here]]=\"\",\"\",IF(Table24[[#This Row],[Type Here]]=Table24[[#This Row],[Answer]],1,-2))","v":""},{"$f":"IF($K$1=1,Table24[[#This Row],[Strength1]],Table24[[#This Row],[Strength2]])","v":-2},{"$f":"IF($K$1=1,D698,G698)","v":"administrative district"},null,{"$f":"IF($K$1=1,IF(E698=\"\",\"\",E698),IF(H698=\"\",\"\",H698))","v":""},{"$f":"IF($K$1=1,G698,D698)","v":"der Landkreis"}]
[null,"29-Medical",{"$f":"IF(AND(LEFT(D699,1)=\"d\",MID(D699,4,1)=\" \"),RIGHT(D699,LEN(D699)-4),D699)","v":"Finger"},"die Finger",null,0,"fingers",null,4,{"$f":"RAND()","v":0.47542599148711073},{"$f":"IF(Table24[[#This Row],[Type Here]]=\"\",\"\",IF(Table24[[#This Row],[Type Here]]=Table24[[#This Row],[Answer]],1,-2))","v":""},{"$f":"IF($K$1=1,Table24[[#This Row],[Strength1]],Table24[[#This Row],[Strength2]])","v":4},{"$f":"IF($K$1=1,D699,G699)","v":"fingers"},null,{"$f":"IF($K$1=1,IF(E699=\"\",\"\",E699),IF(H699=\"\",\"\",H699))","v":""},{"$f":"IF($K$1=1,G699,D699)","v":"die Finger"}]
[null,"11-Family",{"$f":"IF(AND(LEFT(D700,1)=\"d\",MID(D700,4,1)=\" \"),RIGHT(D700,LEN(D700)-4),D700)","v":"Eltern"},"die Eltern",null,null,"parents",null,null,{"$f":"RAND()","v":0.667462760266217},{"$f":"IF(Table24[[#This Row],[Type Here]]=\"\",\"\",IF(Table24[[#This Row],[Type Here]]=Table24[[#This Row],[Answer]],1,-2))","v":""},{"$f":"IF($K$1=1,Table24[[#This Row],[Strength1]],Table24[[#This Row],[Strength2]])","v":0},{"$f":"IF($K$1=1,D700,G700)","v":"parents"},null,{"$f":"IF($K$1=1,IF(E700=\"\",\"\",E700),IF(H700=\"\",\"\",H700))","v":""},{"$f":"IF($K$1=1,G700,D700)","v":"die Eltern"}]
[null,"29-Medical",{"$f":"IF(AND(LEFT(D701,1)=\"d\",MID(D701,4,1)=\" \"),RIGHT(D701,LEN(D701)-4),D701)","v":"Medikamente"},"die Medikamente",null,0,"medications",null,0,{"$f":"RAND()","v":0.7083650718566018},{"$f":"IF(Table24[[#This Row],[Type Here]]=\"\",\"\",IF(Table24[[#This Row],[Type Here]]=Table24[[#This Row],[Answer]],1,-2))","v":""},{"$f":"IF($K$1=1,Table24[[#This Row],[Strength1]],Table24[[#This Row],[Strength2]])","v":0},{"$f":"IF($K$1=1,D701,G701)","v":"medications"},null,{"$f":"IF($K$1=1,IF(E701=\"\",\"\",E701),IF(H701=\"\",\"\",H701))","v":""},{"$f":"IF($K$1=1,G701,D701)","v":"die Medikamente"}]
[null,"01-Basics 1",{"$f":"IF(AND(LEFT(D702,1)=\"d\",MID(D702,4,1)=\" \"),RIGHT(D702,LEN(D702)-4),D702)","v":"den"},"den","(article - Acc masc)",0,"the","Acc masc",0,{"$f":"RAND()","v":0.4882519519804964},{"$f":"IF(Table24[[#This Row],[Type Here]]=\"\",\"\",IF(Table24[[#This Row],[Type Here]]=Table24[[#This Row],[Answer]],1,-2))","v":""},{"$f":"IF($K$1=1,Table24[[#This Row],[Strength1]],Table24[[#This Row],[Strength2]])","v":0},{"$f":"IF($K$1=1,D702,G702)","v":"the"},null,{"$f":"IF($K$1=1,IF(E702=\"\",\"\",E702),IF(H702=\"\",\"\",H702))","v":"Acc masc"},{"$f":"IF($K$1=1,G702,D702)","v":"den"}]
[null,"03-Phrases",{"$f":"IF(AND(LEFT(D703,1)=\"d\",MID(D703,4,1)=\" \"),RIGHT(D703,LEN(D703)-4),D703)","v":"ja"},"ja",null,0,"yes",null,0,{"$f":"RAND()","v":0.7996980610882306},{"$f":"IF(Table24[[#This Row],[Type Here]]=\"\",\"\",IF(Table24[[#This Row],[Type Here]]=Table24[[#This Row],[Answer]],1,-2))","v":""},{"$f":"IF($K$1=1,Table24[[#This Row],[Strength1]],Table24[[#This Row],[Strength2]])","v":0},{"$f":"IF($K$1=1,D703,G703)","v":"yes"},null,{"$f":"IF($K$1=1,IF(E703=\"\",\"\",E703),IF(H703=\"\",\"\",H703))","v":""},{"$f":"IF($K$1=1,G703,D703)","v":"ja"}]
[null,"08-V. Pres. 1",{"$f":"IF(AND(LEFT(D704,1)=\"d\",MID(D704,4,1)=\" \"),RIGHT(D704,LEN(D704)-4),D704)","v":"sprechen"},"sprechen",null,0,"to speak",null,0,{"$f":"RAND()","v":0.09380410365767633},{"$f":"IF(Table24[[#This Row],[Type Here]]=\"\",\"\",IF(Table24[[#This Row],[Type Here]]=Table24[[#This Row],[Answer]],1,-2))","v":""},{"$f":"IF($K$1=1,Table24[[#This Row],[Strength1]],Table24[[#This Row],[Strength2]])","v":0},{"$f":"IF($K$1=1,D704,G704)","v":"to speak"},null,{"$f":"IF($K$1=1,IF(E704=\"\",\"\",E704),IF(H704=\"\",\"\",H704))","v":""},{"$f":"IF($K$1=1,G704,D704)","v":"sprechen"}]
[null,"01-Basics 1",{"$f":"IF(AND(LEFT(D705,1)=\"d\",MID(D705,4,1)=\" \"),RIGHT(D705,LEN(D705)-4),D705)","v":"ein"},"ein","(article - Nom neut)",0,"a","Nom neut",0,{"$f":"RAND()","v":0.8573678960924979},{"$f":"IF(Table24[[#This Row],[Type Here]]=\"\",\"\",IF(Table24[[#This Row],[Type Here]]=Table24[[#This Row],[Answer]],1,-2))","v":""},{"$f":"IF($K$1=1,Table24[[#This Row],[Strength1]],Table24[[#This Row],[Strength2]])","v":0},{"$f":"IF($K$1=1,D705,G705)","v":"a"},null,{"$f":"IF($K$1=1,IF(E705=\"\",\"\",E705),IF(H705=\"\",\"\",H705))","v":"Nom neut"},{"$f":"IF($K$1=1,G705,D705)","v":"ein"}]
[null,"10-Nom. Pron.",{"$f":"IF(AND(LEFT(D706,1)=\"d\",MID(D706,4,1)=\" \"),RIGHT(D706,LEN(D706)-4),D706)","v":"man"},"man",null,0,"one","one person",1,{"$f":"RAND()","v":0.3572990259417911},{"$f":"IF(Table24[[#This Row],[Type Here]]=\"\",\"\",IF(Table24[[#This Row],[Type Here]]=Table24[[#This Row],[Answer]],1,-2))","v":""},{"$f":"IF($K$1=1,Table24[[#This Row],[Strength1]],Table24[[#This Row],[Strength2]])","v":1},{"$f":"IF($K$1=1,D706,G706)","v":"one"},null,{"$f":"IF($K$1=1,IF(E706=\"\",\"\",E706),IF(H706=\"\",\"\",H706))","v":"one person"},{"$f":"IF($K$1=1,G706,D706)","v":"man"}]
[null,"09-Clothing",{"$f":"IF(AND(LEFT(D707,1)=\"d\",MID(D707,4,1)=\" \"),RIGHT(D707,LEN(D707)-4),D707)","v":"Leder"},"das Leder",null,0,"leather",null,1,{"$f":"RAND()","v":0.0884767209964461},{"$f":"IF(Table24[[#This Row],[Type Here]]=\"\",\"\",IF(Table24[[#This Row],[Type Here]]=Table24[[#This Row],[Answer]],1,-2))","v":""},{"$f":"IF($K$1=1,Table24[[#This Row],[Strength1]],Table24[[#This Row],[Strength2]])","v":1},{"$f":"IF($K$1=1,D707,G707)","v":"leather"},null,{"$f":"IF($K$1=1,IF(E707=\"\",\"\",E707),IF(H707=\"\",\"\",H707))","v":""},{"$f":"IF($K$1=1,G707,D707)","v":"das Leder"}]
[null,"40-Places",{"$f":"IF(AND(LEFT(D708,1)=\"d\",MID(D708,4,1)=\" \"),RIGHT(D708,LEN(D708)-4),D708)","v":"Heimaten"},"die Heimaten",null,0,"homes","(native lands or places)",2,{"$f":"RAND()","v":0.19392662028349816},{"$f":"IF(Table24[[#This Row],[Type Here]]=\"\",\"\",IF(Table24[[#This Row],[Type Here]]=Table24[[#This Row],[Answer]],1,-2))","v":""},{"$f":"IF($K$1=1,Table24[[#This Row],[Strength1]],Table24[[#This Row],[Strength2]])","v":2},{"$f":"IF($K$1=1,D708,G708)","v":"homes"},null,{"$f":"IF($K$1=1,IF(E708=\"\",\"\",E708),IF(H708=\"\",\"\",H708))","v":"(native lands or places)"},{"$f":"IF($K$1=1,G708,D708)","v":"die Heimaten"}]
[null,"40-Places",{"$f":"IF(AND(LEFT(D709,1)=\"d\",MID(D709,4,1)=\" \"),RIGHT(D709,LEN(D709)-4),D709)","v":"Zentralen"},"die Zentralen",null,0,"main offices","headquarters",2,{"$f":"RAND()","v":0.7735474835349221},{"$f":"IF(Table24[[#This Row],[Type Here]]=\"\",\"\",IF(Table24[[#This Row],[Type Here]]=Table24[[#This Row],[Answer]],1,-2))","v":""},{"$f":"IF($K$1=1,Table24[[#This Row],[Strength1]],Table24[[#This Row],[Strength2]])","v":2},{"$f":"IF($K$1=1,D709,G709)","v":"main offices"},null,{"$f":"IF($K$1=1,IF(E709=\"\",\"\",E709),IF(H709=\"\",\"\",H709))","v":"headquarters"},{"$f":"IF($K$1=1,G709,D709)","v":"die Zentralen"}]
[null,"11-Family",{"$f":"IF(AND(LEFT(D710,1)=\"d\",MID(D710,4,1)=\" \"),RIGHT(D710,LEN(D710)-4),D710)","v":"Schwester"},"die Schwester",null,null,"sister",null,null,{"$f":"RAND()","v":0.3337543556530099},{"$f":"IF(Table24[[#This Row],[Type Here]]=\"\",\"\",IF(Table24[[#This Row],[Type Here]]=Table24[[#This Row],[Answer]],1,-2))","v":""},{"$f":"IF($K$1=1,Table24[[#This Row],[Strength1]],Table24[[#This Row],[Strength2]])","v":0},{"$f":"IF($K$1=1,D710,G710)","v":"sister"},null,{"$f":"IF($K$1=1,IF(E710=\"\",\"\",E710),IF(H710=\"\",\"\",H710))","v":""},{"$f":"IF($K$1=1,G710,D710)","v":"die Schwester"}]
[null,"14-Household",{"$f":"IF(AND(LEFT(D711,1)=\"d\",MID(D711,4,1)=\" \"),RIGHT(D711,LEN(D711)-4),D711)","v":"Seifen"},"die Seifen",null,0,"soaps",null,1,{"$f":"RAND()","v":0.8926017024490526},{"$f":"IF(Table24[[#This Row],[Type Here]]=\"\",\"\",IF(Table24[[#This Row],[Type Here]]=Table24[[#This Row],[Answer]],1,-2))","v":""},{"$f":"IF($K$1=1,Table24[[#This Row],[Strength1]],Table24[[#This Row],[Strength2]])","v":1},{"$f":"IF($K$1=1,D711,G711)","v":"soaps"},null,{"$f":"IF($K$1=1,IF(E711=\"\",\"\",E711),IF(H711=\"\",\"\",H711))","v":""},{"$f":"IF($K$1=1,G711,D711)","v":"die Seifen"}]
[null,"14-Household",{"$f":"IF(AND(LEFT(D712,1)=\"d\",MID(D712,4,1)=\" \"),RIGHT(D712,LEN(D712)-4),D712)","v":"Stühle"},"die Stühle",null,0,"chairs",null,1,{"$f":"RAND()","v":0.19271867242795604},{"$f":"IF(Table24[[#This Row],[Type Here]]=\"\",\"\",IF(Table24[[#This Row],[Type Here]]=Table24[[#This Row],[Answer]],1,-2))","v":""},{"$f":"IF($K$1=1,Table24[[#This Row],[Strength1]],Table24[[#This Row],[Strength2]])","v":1},{"$f":"IF($K$1=1,D712,G712)","v":"chairs"},null,{"$f":"IF($K$1=1,IF(E712=\"\",\"\",E712),IF(H712=\"\",\"\",H712))","v":""},{"$f":"IF($K$1=1,G712,D712)","v":"die Stühle"}]
[null,"40-Places",{"$f":"IF(AND(LEFT(D713,1)=\"d\",MID(D713,4,1)=\" \"),RIGHT(D713,LEN(D713)-4),D713)","v":"Park"},"der Park",null,0,"park","noun",2,{"$f":"RAND()","v":0.2154982841935953},{"$f":"IF(Table24[[#This Row],[Type Here]]=\"\",\"\",IF(Table24[[#This Row],[Type Here]]=Table24[[#This Row],[Answer]],1,-2))","v":""},{"$f":"IF($K$1=1,Table24[[#This Row],[Strength1]],Table24[[#This Row],[Strength2]])","v":2},{"$f":"IF($K$1=1,D713,G713)","v":"park"},null,{"$f":"IF($K$1=1,IF(E713=\"\",\"\",E713),IF(H713=\"\",\"\",H713))","v":"noun"},{"$f":"IF($K$1=1,G713,D713)","v":"der Park"}]
[null,"01-Basics 1",{"$f":"IF(AND(LEFT(D714,1)=\"d\",MID(D714,4,1)=\" \"),RIGHT(D714,LEN(D714)-4),D714)","v":"Wasser"},"das Wasser",null,0,"water","(noun)",1,{"$f":"RAND()","v":0.9376060152188938},{"$f":"IF(Table24[[#This Row],[Type Here]]=\"\",\"\",IF(Table24[[#This Row],[Type Here]]=Table24[[#This Row],[Answer]],1,-2))","v":""},{"$f":"IF($K$1=1,Table24[[#This Row],[Strength1]],Table24[[#This Row],[Strength2]])","v":1},{"$f":"IF($K$1=1,D714,G714)","v":"water"},null,{"$f":"IF($K$1=1,IF(E714=\"\",\"\",E714),IF(H714=\"\",\"\",H714))","v":"(noun)"},{"$f":"IF($K$1=1,G714,D714)","v":"das Wasser"}]
[null,"40-Places",{"$f":"IF(AND(LEFT(D715,1)=\"d\",MID(D715,4,1)=\" \"),RIGHT(D715,LEN(D715)-4),D715)","v":"Dörfer"},"die Dörfer",null,0,"villages",null,-5,{"$f":"RAND()","v":0.2992697102307078},{"$f":"IF(Table24[[#This Row],[Type Here]]=\"\",\"\",IF(Table24[[#This Row],[Type Here]]=Table24[[#This Row],[Answer]],1,-2))","v":""},{"$f":"IF($K$1=1,Table24[[#This Row],[Strength1]],Table24[[#This Row],[Strength2]])","v":-5},{"$f":"IF($K$1=1,D715,G715)","v":"villages"},null,{"$f":"IF($K$1=1,IF(E715=\"\",\"\",E715),IF(H715=\"\",\"\",H715))","v":""},{"$f":"IF($K$1=1,G715,D715)","v":"die Dörfer"}]
[null,"14-Household",{"$f":"IF(AND(LEFT(D716,1)=\"d\",MID(D716,4,1)=\" \"),RIGHT(D716,LEN(D716)-4),D716)","v":"Leiterinnen"},"die Leiterinnen",null,0,"leaders","female",1,{"$f":"RAND()","v":0.5345884184325692},{"$f":"IF(Table24[[#This Row],[Type Here]]=\"\",\"\",IF(Table24[[#This Row],[Type Here]]=Table24[[#This Row],[Answer]],1,-2))","v":""},{"$f":"IF($K$1=1,Table24[[#This Row],[Strength1]],Table24[[#This Row],[Strength2]])","v":1},{"$f":"IF($K$1=1,D716,G716)","v":"leaders"},null,{"$f":"IF($K$1=1,IF(E716=\"\",\"\",E716),IF(H716=\"\",\"\",H716))","v":"female"},{"$f":"IF($K$1=1,G716,D716)","v":"die Leiterinnen"}]
[null,"38-Ad: Nom. 1",{"$f":"IF(AND(LEFT(D717,1)=\"d\",MID(D717,4,1)=\" \"),RIGHT(D717,LEN(D717)-4),D717)","v":"hohe Berge"},"hohe Berge",null,0,"high mountains","Nom or Acc",3,{"$f":"RAND()","v":0.8137382699623911},{"$f":"IF(Table24[[#This Row],[Type Here]]=\"\",\"\",IF(Table24[[#This Row],[Type Here]]=Table24[[#This Row],[Answer]],1,-2))","v":""},{"$f":"IF($K$1=1,Table24[[#This Row],[Strength1]],Table24[[#This Row],[Strength2]])","v":3},{"$f":"IF($K$1=1,D717,G717)","v":"high mountains"},null,{"$f":"IF($K$1=1,IF(E717=\"\",\"\",E717),IF(H717=\"\",\"\",H717))","v":"Nom or Acc"},{"$f":"IF($K$1=1,G717,D717)","v":"hohe Berge"}]
[null,"05-Animals",{"$f":"IF(AND(LEFT(D718,1)=\"d\",MID(D718,4,1)=\" \"),RIGHT(D718,LEN(D718)-4),D718)","v":"Biene"},"die Biene",null,0,"bee",null,0,{"$f":"RAND()","v":0.8034341179838674},{"$f":"IF(Table24[[#This Row],[Type Here]]=\"\",\"\",IF(Table24[[#This Row],[Type Here]]=Table24[[#This Row],[Answer]],1,-2))","v":""},{"$f":"IF($K$1=1,Table24[[#This Row],[Strength1]],Table24[[#This Row],[Strength2]])","v":0},{"$f":"IF($K$1=1,D718,G718)","v":"bee"},null,{"$f":"IF($K$1=1,IF(E718=\"\",\"\",E718),IF(H718=\"\",\"\",H718))","v":""},{"$f":"IF($K$1=1,G718,D718)","v":"die Biene"}]
[null,"29-Medical",{"$f":"IF(AND(LEFT(D719,1)=\"d\",MID(D719,4,1)=\" \"),RIGHT(D719,LEN(D719)-4),D719)","v":"Sucht"},"die Sucht",null,0,"addiction",null,1,{"$f":"RAND()","v":0.24706361618283834},{"$f":"IF(Table24[[#This Row],[Type Here]]=\"\",\"\",IF(Table24[[#This Row],[Type Here]]=Table24[[#This Row],[Answer]],1,-2))","v":""},{"$f":"IF($K$1=1,Table24[[#This Row],[Strength1]],Table24[[#This Row],[Strength2]])","v":1},{"$f":"IF($K$1=1,D719,G719)","v":"addiction"},null,{"$f":"IF($K$1=1,IF(E719=\"\",\"\",E719),IF(H719=\"\",\"\",H719))","v":""},{"$f":"IF($K$1=1,G719,D719)","v":"die Sucht"}]
[null,"14-Household",{"$f":"IF(AND(LEFT(D720,1)=\"d\",MID(D720,4,1)=\" \"),RIGHT(D720,LEN(D720)-4),D720)","v":"Betten"},"die Betten",null,0,"beds",null,2,{"$f":"RAND()","v":0.9706177437097997},{"$f":"IF(Table24[[#This Row],[Type Here]]=\"\",\"\",IF(Table24[[#This Row],[Type Here]]=Table24[[#This Row],[Answer]],1,-2))","v":""},{"$f":"IF($K$1=1,Table24[[#This Row],[Strength1]],Table24[[#This Row],[Strength2]])","v":2},{"$f":"IF($K$1=1,D720,G720)","v":"beds"},null,{"$f":"IF($K$1=1,IF(E720=\"\",\"\",E720),IF(H720=\"\",\"\",H720))","v":""},{"$f":"IF($K$1=1,G720,D720)","v":"die Betten"}]
[null,"33-Adverbs 1",{"$f":"IF(AND(LEFT(D721,1)=\"d\",MID(D721,4,1)=\" \"),RIGHT(D721,LEN(D721)-4),D721)","v":"jedenfalls"},"jedenfalls",null,0,"in any case",null,0,{"$f":"RAND()","v":0.21411661762831202},{"$f":"IF(Table24[[#This Row],[Type Here]]=\"\",\"\",IF(Table24[[#This Row],[Type Here]]=Table24[[#This Row],[Answer]],1,-2))","v":""},{"$f":"IF($K$1=1,Table24[[#This Row],[Strength1]],Table24[[#This Row],[Strength2]])","v":0},{"$f":"IF($K$1=1,D721,G721)","v":"in any case"},null,{"$f":"IF($K$1=1,IF(E721=\"\",\"\",E721),IF(H721=\"\",\"\",H721))","v":""},{"$f":"IF($K$1=1,G721,D721)","v":"jedenfalls"}]
[null,"38-Ad: Nom. 1",{"$f":"IF(AND(LEFT(D722,1)=\"d\",MID(D722,4,1)=\" \"),RIGHT(D722,LEN(D722)-4),D722)","v":"müde"},"müde",null,0,"tired",null,3,{"$f":"RAND()","v":0.4002201576944072},{"$f":"IF(Table24[[#This Row],[Type Here]]=\"\",\"\",IF(Table24[[#This Row],[Type Here]]=Table24[[#This Row],[Answer]],1,-2))","v":""},{"$f":"IF($K$1=1,Table24[[#This Row],[Strength1]],Table24[[#This Row],[Strength2]])","v":3},{"$f":"IF($K$1=1,D722,G722)","v":"tired"},null,{"$f":"IF($K$1=1,IF(E722=\"\",\"\",E722),IF(H722=\"\",\"\",H722))","v":""},{"$f":"IF($K$1=1,G722,D722)","v":"müde"}]
[null,"14-Household",{"$f":"IF(AND(LEFT(D723,1)=\"d\",MID(D723,4,1)=\" \"),RIGHT(D723,LEN(D723)-4),D723)","v":"Bett"},"das Bett",null,0,"bed",null,1,{"$f":"RAND()","v":0.36793781633623146},{"$f":"IF(Table24[[#This Row],[Type Here]]=\"\",\"\",IF(Table24[[#This Row],[Type Here]]=Table24[[#This Row],[Answer]],1,-2))","v":""},{"$f":"IF($K$1=1,Table24[[#This Row],[Strength1]],Table24[[#This Row],[Strength2]])","v":1},{"$f":"IF($K$1=1,D723,G723)","v":"bed"},null,{"$f":"IF($K$1=1,IF(E723=\"\",\"\",E723),IF(H723=\"\",\"\",H723))","v":""},{"$f":"IF($K$1=1,G723,D723)","v":"das Bett"}]
[null,"04-Food",{"$f":"IF(AND(LEFT(D724,1)=\"d\",MID(D724,4,1)=\" \"),RIGHT(D724,LEN(D724)-4),D724)","v":"Nudeln"},"die Nudeln",null,0,"noodles",null,5,{"$f":"RAND()","v":0.17329769168584241},{"$f":"IF(Table24[[#This Row],[Type Here]]=\"\",\"\",IF(Table24[[#This Row],[Type Here]]=Table24[[#This Row],[Answer]],1,-2))","v":""},{"$f":"IF($K$1=1,Table24[[#This Row],[Strength1]],Table24[[#This Row],[Strength2]])","v":5},{"$f":"IF($K$1=1,D724,G724)","v":"noodles"},null,{"$f":"IF($K$1=1,IF(E724=\"\",\"\",E724),IF(H724=\"\",\"\",H724))","v":""},{"$f":"IF($K$1=1,G724,D724)","v":"die Nudeln"}]
[null,"01-Basics 1",{"$f":"IF(AND(LEFT(D725,1)=\"d\",MID(D725,4,1)=\" \"),RIGHT(D725,LEN(D725)-4),D725)","v":"eine"},"eine","(article - Nom fem)",0,"a","Nom fem",0,{"$f":"RAND()","v":0.1955575053207067},{"$f":"IF(Table24[[#This Row],[Type Here]]=\"\",\"\",IF(Table24[[#This Row],[Type Here]]=Table24[[#This Row],[Answer]],1,-2))","v":""},{"$f":"IF($K$1=1,Table24[[#This Row],[Strength1]],Table24[[#This Row],[Strength2]])","v":0},{"$f":"IF($K$1=1,D725,G725)","v":"a"},null,{"$f":"IF($K$1=1,IF(E725=\"\",\"\",E725),IF(H725=\"\",\"\",H725))","v":"Nom fem"},{"$f":"IF($K$1=1,G725,D725)","v":"eine"}]
[null,"02-Basics 2",{"$f":"IF(AND(LEFT(D726,1)=\"d\",MID(D726,4,1)=\" \"),RIGHT(D726,LEN(D726)-4),D726)","v":"sie"},"sie","3rd person plural",0,"they",null,0,{"$f":"RAND()","v":0.5197777317672602},{"$f":"IF(Table24[[#This Row],[Type Here]]=\"\",\"\",IF(Table24[[#This Row],[Type Here]]=Table24[[#This Row],[Answer]],1,-2))","v":""},{"$f":"IF($K$1=1,Table24[[#This Row],[Strength1]],Table24[[#This Row],[Strength2]])","v":0},{"$f":"IF($K$1=1,D726,G726)","v":"they"},null,{"$f":"IF($K$1=1,IF(E726=\"\",\"\",E726),IF(H726=\"\",\"\",H726))","v":""},{"$f":"IF($K$1=1,G726,D726)","v":"sie"}]
[null,"06-Plurals",{"$f":"IF(AND(LEFT(D727,1)=\"d\",MID(D727,4,1)=\" \"),RIGHT(D727,LEN(D727)-4),D727)","v":"Kartoffeln"},"die Kartoffeln",null,0,"potatoes",null,0,{"$f":"RAND()","v":0.4582305250022095},{"$f":"IF(Table24[[#This Row],[Type Here]]=\"\",\"\",IF(Table24[[#This Row],[Type Here]]=Table24[[#This Row],[Answer]],1,-2))","v":""},{"$f":"IF($K$1=1,Table24[[#This Row],[Strength1]],Table24[[#This Row],[Strength2]])","v":0},{"$f":"IF($K$1=1,D727,G727)","v":"potatoes"},null,{"$f":"IF($K$1=1,IF(E727=\"\",\"\",E727),IF(H727=\"\",\"\",H727))","v":""},{"$f":"IF($K$1=1,G727,D727)","v":"die Kartoffeln"}]
[null,"22-Colors",{"$f":"IF(AND(LEFT(D728,1)=\"d\",MID(D728,4,1)=\" \"),RIGHT(D728,LEN(D728)-4),D728)","v":"grün"},"grün",null,0,"green",null,1,{"$f":"RAND()","v":0.006394693775032101},{"$f":"IF(Table24[[#This Row],[Type Here]]=\"\",\"\",IF(Table24[[#This Row],[Type Here]]=Table24[[#This Row],[Answer]],1,-2))","v":""},{"$f":"IF($K$1=1,Table24[[#This Row],[Strength1]],Table24[[#This Row],[Strength2]])","v":1},{"$f":"IF($K$1=1,D728,G728)","v":"green"},null,{"$f":"IF($K$1=1,IF(E728=\"\",\"\",E728),IF(H728=\"\",\"\",H728))","v":""},{"$f":"IF($K$1=1,G728,D728)","v":"grün"}]
[null,"29-Medical",{"$f":"IF(AND(LEFT(D729,1)=\"d\",MID(D729,4,1)=\" \"),RIGHT(D729,LEN(D729)-4),D729)","v":"Untersuchungen"},"die Untersuchungen",null,0,"tests",null,5,{"$f":"RAND()","v":0.46746718776505103},{"$f":"IF(Table24[[#This Row],[Type Here]]=\"\",\"\",IF(Table24[[#This Row],[Type Here]]=Table24[[#This Row],[Answer]],1,-2))","v":""},{"$f":"IF($K$1=1,Table24[[#This Row],[Strength1]],Table24[[#This Row],[Strength2]])","v":5},{"$f":"IF($K$1=1,D729,G729)","v":"tests"},null,{"$f":"IF($K$1=1,IF(E729=\"\",\"\",E729),IF(H729=\"\",\"\",H729))","v":""},{"$f":"IF($K$1=1,G729,D729)","v":"die Untersuchungen"}]
[null,"02-Basics 2",{"$f":"IF(AND(LEFT(D730,1)=\"d\",MID(D730,4,1)=\" \"),RIGHT(D730,LEN(D730)-4),D730)","v":"Buch"},"das Buch",null,0,"book",null,1,{"$f":"RAND()","v":0.9633809858340547},{"$f":"IF(Table24[[#This Row],[Type Here]]=\"\",\"\",IF(Table24[[#This Row],[Type Here]]=Table24[[#This Row],[Answer]],1,-2))","v":""},{"$f":"IF($K$1=1,Table24[[#This Row],[Strength1]],Table24[[#This Row],[Strength2]])","v":1},{"$f":"IF($K$1=1,D730,G730)","v":"book"},null,{"$f":"IF($K$1=1,IF(E730=\"\",\"\",E730),IF(H730=\"\",\"\",H730))","v":""},{"$f":"IF($K$1=1,G730,D730)","v":"das Buch"}]
[null,"36-Nature",{"$f":"IF(AND(LEFT(D731,1)=\"d\",MID(D731,4,1)=\" \"),RIGHT(D731,LEN(D731)-4),D731)","v":"Welt"},"die Welt",null,0,"world",null,6,{"$f":"RAND()","v":0.2831198848547566},{"$f":"IF(Table24[[#This Row],[Type Here]]=\"\",\"\",IF(Table24[[#This Row],[Type Here]]=Table24[[#This Row],[Answer]],1,-2))","v":""},{"$f":"IF($K$1=1,Table24[[#This Row],[Strength1]],Table24[[#This Row],[Strength2]])","v":6},{"$f":"IF($K$1=1,D731,G731)","v":"world"},null,{"$f":"IF($K$1=1,IF(E731=\"\",\"\",E731),IF(H731=\"\",\"\",H731))","v":""},{"$f":"IF($K$1=1,G731,D731)","v":"die Welt"}]
[null,"40-Places",{"$f":"IF(AND(LEFT(D732,1)=\"d\",MID(D732,4,1)=\" \"),RIGHT(D732,LEN(D732)-4),D732)","v":"City"},"die City",null,0,"downtown",null,1,{"$f":"RAND()","v":0.36225148811237073},{"$f":"IF(Table24[[#This Row],[Type Here]]=\"\",\"\",IF(Table24[[#This Row],[Type Here]]=Table24[[#This Row],[Answer]],1,-2))","v":""},{"$f":"IF($K$1=1,Table24[[#This Row],[Strength1]],Table24[[#This Row],[Strength2]])","v":1},{"$f":"IF($K$1=1,D732,G732)","v":"downtown"},null,{"$f":"IF($K$1=1,IF(E732=\"\",\"\",E732),IF(H732=\"\",\"\",H732))","v":""},{"$f":"IF($K$1=1,G732,D732)","v":"die City"}]
[null,"39-Adj: Acc.",{"$f":"IF(AND(LEFT(D733,1)=\"d\",MID(D733,4,1)=\" \"),RIGHT(D733,LEN(D733)-4),D733)","v":"zweite"},"zweite",null,0,"second","(2nd)",9,{"$f":"RAND()","v":0.852826869890378},{"$f":"IF(Table24[[#This Row],[Type Here]]=\"\",\"\",IF(Table24[[#This Row],[Type Here]]=Table24[[#This Row],[Answer]],1,-2))","v":""},{"$f":"IF($K$1=1,Table24[[#This Row],[Strength1]],Table24[[#This Row],[Strength2]])","v":9},{"$f":"IF($K$1=1,D733,G733)","v":"second"},null,{"$f":"IF($K$1=1,IF(E733=\"\",\"\",E733),IF(H733=\"\",\"\",H733))","v":"(2nd)"},{"$f":"IF($K$1=1,G733,D733)","v":"zweite"}]
[null,"33-Adverbs 1",{"$f":"IF(AND(LEFT(D734,1)=\"d\",MID(D734,4,1)=\" \"),RIGHT(D734,LEN(D734)-4),D734)","v":"weg"},"weg",null,0,"away",null,0,{"$f":"RAND()","v":0.20981963082412436},{"$f":"IF(Table24[[#This Row],[Type Here]]=\"\",\"\",IF(Table24[[#This Row],[Type Here]]=Table24[[#This Row],[Answer]],1,-2))","v":""},{"$f":"IF($K$1=1,Table24[[#This Row],[Strength1]],Table24[[#This Row],[Strength2]])","v":0},{"$f":"IF($K$1=1,D734,G734)","v":"away"},null,{"$f":"IF($K$1=1,IF(E734=\"\",\"\",E734),IF(H734=\"\",\"\",H734))","v":""},{"$f":"IF($K$1=1,G734,D734)","v":"weg"}]
[null,"08-V. Pres. 1",{"$f":"IF(AND(LEFT(D735,1)=\"d\",MID(D735,4,1)=\" \"),RIGHT(D735,LEN(D735)-4),D735)","v":"sehen"},"sehen",null,0,"to see",null,0,{"$f":"RAND()","v":0.5344786240394397},{"$f":"IF(Table24[[#This Row],[Type Here]]=\"\",\"\",IF(Table24[[#This Row],[Type Here]]=Table24[[#This Row],[Answer]],1,-2))","v":""},{"$f":"IF($K$1=1,Table24[[#This Row],[Strength1]],Table24[[#This Row],[Strength2]])","v":0},{"$f":"IF($K$1=1,D735,G735)","v":"to see"},null,{"$f":"IF($K$1=1,IF(E735=\"\",\"\",E735),IF(H735=\"\",\"\",H735))","v":""},{"$f":"IF($K$1=1,G735,D735)","v":"sehen"}]
[null,"33-Adverbs 1",{"$f":"IF(AND(LEFT(D736,1)=\"d\",MID(D736,4,1)=\" \"),RIGHT(D736,LEN(D736)-4),D736)","v":"Zeitschrift"},"die Zeitschrift",null,0,"magazine",null,0,{"$f":"RAND()","v":0.36269660731441666},{"$f":"IF(Table24[[#This Row],[Type Here]]=\"\",\"\",IF(Table24[[#This Row],[Type Here]]=Table24[[#This Row],[Answer]],1,-2))","v":""},{"$f":"IF($K$1=1,Table24[[#This Row],[Strength1]],Table24[[#This Row],[Strength2]])","v":0},{"$f":"IF($K$1=1,D736,G736)","v":"magazine"},null,{"$f":"IF($K$1=1,IF(E736=\"\",\"\",E736),IF(H736=\"\",\"\",H736))","v":""},{"$f":"IF($K$1=1,G736,D736)","v":"die Zeitschrift"}]
[null,"36-Nature",{"$f":"IF(AND(LEFT(D737,1)=\"d\",MID(D737,4,1)=\" \"),RIGHT(D737,LEN(D737)-4),D737)","v":"Pflanzen"},"die Pflanzen",null,0,"plants","(vegetation)",6,{"$f":"RAND()","v":0.8361981866610569},{"$f":"IF(Table24[[#This Row],[Type Here]]=\"\",\"\",IF(Table24[[#This Row],[Type Here]]=Table24[[#This Row],[Answer]],1,-2))","v":""},{"$f":"IF($K$1=1,Table24[[#This Row],[Strength1]],Table24[[#This Row],[Strength2]])","v":6},{"$f":"IF($K$1=1,D737,G737)","v":"plants"},null,{"$f":"IF($K$1=1,IF(E737=\"\",\"\",E737),IF(H737=\"\",\"\",H737))","v":"(vegetation)"},{"$f":"IF($K$1=1,G737,D737)","v":"die Pflanzen"}]
[null,"11-Family",{"$f":"IF(AND(LEFT(D738,1)=\"d\",MID(D738,4,1)=\" \"),RIGHT(D738,LEN(D738)-4),D738)","v":"Großmütter"},"die Großmütter",null,null,"grandmothers",null,null,{"$f":"RAND()","v":0.9424968422812555},{"$f":"IF(Table24[[#This Row],[Type Here]]=\"\",\"\",IF(Table24[[#This Row],[Type Here]]=Table24[[#This Row],[Answer]],1,-2))","v":""},{"$f":"IF($K$1=1,Table24[[#This Row],[Strength1]],Table24[[#This Row],[Strength2]])","v":0},{"$f":"IF($K$1=1,D738,G738)","v":"grandmothers"},null,{"$f":"IF($K$1=1,IF(E738=\"\",\"\",E738),IF(H738=\"\",\"\",H738))","v":""},{"$f":"IF($K$1=1,G738,D738)","v":"die Großmütter"}]
[null,"11-Family",{"$f":"IF(AND(LEFT(D739,1)=\"d\",MID(D739,4,1)=\" \"),RIGHT(D739,LEN(D739)-4),D739)","v":"Tochter"},"die Tochter",null,null,"daughter",null,null,{"$f":"RAND()","v":0.10225912647349367},{"$f":"IF(Table24[[#This Row],[Type Here]]=\"\",\"\",IF(Table24[[#This Row],[Type Here]]=Table24[[#This Row],[Answer]],1,-2))","v":""},{"$f":"IF($K$1=1,Table24[[#This Row],[Strength1]],Table24[[#This Row],[Strength2]])","v":0},{"$f":"IF($K$1=1,D739,G739)","v":"daughter"},null,{"$f":"IF($K$1=1,IF(E739=\"\",\"\",E739),IF(H739=\"\",\"\",H739))","v":""},{"$f":"IF($K$1=1,G739,D739)","v":"die Tochter"}]
[null,"05-Animals",{"$f":"IF(AND(LEFT(D740,1)=\"d\",MID(D740,4,1)=\" \"),RIGHT(D740,LEN(D740)-4),D740)","v":"Vögel"},"die Vögel",null,0,"birds",null,1,{"$f":"RAND()","v":0.3539822740835852},{"$f":"IF(Table24[[#This Row],[Type Here]]=\"\",\"\",IF(Table24[[#This Row],[Type Here]]=Table24[[#This Row],[Answer]],1,-2))","v":""},{"$f":"IF($K$1=1,Table24[[#This Row],[Strength1]],Table24[[#This Row],[Strength2]])","v":1},{"$f":"IF($K$1=1,D740,G740)","v":"birds"},null,{"$f":"IF($K$1=1,IF(E740=\"\",\"\",E740),IF(H740=\"\",\"\",H740))","v":""},{"$f":"IF($K$1=1,G740,D740)","v":"die Vögel"}]
[null,"33-Adverbs 1",{"$f":"IF(AND(LEFT(D741,1)=\"d\",MID(D741,4,1)=\" \"),RIGHT(D741,LEN(D741)-4),D741)","v":"besonders"},"besonders",null,0,"especially",null,1,{"$f":"RAND()","v":0.48494607629614905},{"$f":"IF(Table24[[#This Row],[Type Here]]=\"\",\"\",IF(Table24[[#This Row],[Type Here]]=Table24[[#This Row],[Answer]],1,-2))","v":""},{"$f":"IF($K$1=1,Table24[[#This Row],[Strength1]],Table24[[#This Row],[Strength2]])","v":1},{"$f":"IF($K$1=1,D741,G741)","v":"especially"},null,{"$f":"IF($K$1=1,IF(E741=\"\",\"\",E741),IF(H741=\"\",\"\",H741))","v":""},{"$f":"IF($K$1=1,G741,D741)","v":"besonders"}]
[null,"33-Adverbs 1",{"$f":"IF(AND(LEFT(D742,1)=\"d\",MID(D742,4,1)=\" \"),RIGHT(D742,LEN(D742)-4),D742)","v":"jedoch"},"jedoch",null,0,"however",null,-1,{"$f":"RAND()","v":0.9241041502907064},{"$f":"IF(Table24[[#This Row],[Type Here]]=\"\",\"\",IF(Table24[[#This Row],[Type Here]]=Table24[[#This Row],[Answer]],1,-2))","v":""},{"$f":"IF($K$1=1,Table24[[#This Row],[Strength1]],Table24[[#This Row],[Strength2]])","v":-1},{"$f":"IF($K$1=1,D742,G742)","v":"however"},null,{"$f":"IF($K$1=1,IF(E742=\"\",\"\",E742),IF(H742=\"\",\"\",H742))","v":""},{"$f":"IF($K$1=1,G742,D742)","v":"jedoch"}]
[null,"40-Places",{"$f":"IF(AND(LEFT(D743,1)=\"d\",MID(D743,4,1)=\" \"),RIGHT(D743,LEN(D743)-4),D743)","v":"Zimmer"},"das Zimmer",null,0,"room","(ex: bedroom)",4,{"$f":"RAND()","v":0.2703813053592502},{"$f":"IF(Table24[[#This Row],[Type Here]]=\"\",\"\",IF(Table24[[#This Row],[Type Here]]=Table24[[#This Row],[Answer]],1,-2))","v":""},{"$f":"IF($K$1=1,Table24[[#This Row],[Strength1]],Table24[[#This Row],[Strength2]])","v":4},{"$f":"IF($K$1=1,D743,G743)","v":"room"},null,{"$f":"IF($K$1=1,IF(E743=\"\",\"\",E743),IF(H743=\"\",\"\",H743))","v":"(ex: bedroom)"},{"$f":"IF($K$1=1,G743,D743)","v":"das Zimmer"}]
[null,"05-Animals",{"$f":"IF(AND(LEFT(D744,1)=\"d\",MID(D744,4,1)=\" \"),RIGHT(D744,LEN(D744)-4),D744)","v":"Insekten"},"die Insekten",null,0,"insects",null,0,{"$f":"RAND()","v":0.08977304796055607},{"$f":"IF(Table24[[#This Row],[Type Here]]=\"\",\"\",IF(Table24[[#This Row],[Type Here]]=Table24[[#This Row],[Answer]],1,-2))","v":""},{"$f":"IF($K$1=1,Table24[[#This Row],[Strength1]],Table24[[#This Row],[Strength2]])","v":0},{"$f":"IF($K$1=1,D744,G744)","v":"insects"},null,{"$f":"IF($K$1=1,IF(E744=\"\",\"\",E744),IF(H744=\"\",\"\",H744))","v":""},{"$f":"IF($K$1=1,G744,D744)","v":"die Insekten"}]
[null,"38-Ad: Nom. 1",{"$f":"IF(AND(LEFT(D745,1)=\"d\",MID(D745,4,1)=\" \"),RIGHT(D745,LEN(D745)-4),D745)","v":"international"},"international",null,0,"international",null,3,{"$f":"RAND()","v":0.22156964102894472},{"$f":"IF(Table24[[#This Row],[Type Here]]=\"\",\"\",IF(Table24[[#This Row],[Type Here]]=Table24[[#This Row],[Answer]],1,-2))","v":""},{"$f":"IF($K$1=1,Table24[[#This Row],[Strength1]],Table24[[#This Row],[Strength2]])","v":3},{"$f":"IF($K$1=1,D745,G745)","v":"international"},null,{"$f":"IF($K$1=1,IF(E745=\"\",\"\",E745),IF(H745=\"\",\"\",H745))","v":""},{"$f":"IF($K$1=1,G745,D745)","v":"international"}]
[null,"33-Adverbs 1",{"$f":"IF(AND(LEFT(D746,1)=\"d\",MID(D746,4,1)=\" \"),RIGHT(D746,LEN(D746)-4),D746)","v":"dort"},"dort",null,0,"there","(location)",0,{"$f":"RAND()","v":0.9108379029736154},{"$f":"IF(Table24[[#This Row],[Type Here]]=\"\",\"\",IF(Table24[[#This Row],[Type Here]]=Table24[[#This Row],[Answer]],1,-2))","v":""},{"$f":"IF($K$1=1,Table24[[#This Row],[Strength1]],Table24[[#This Row],[Strength2]])","v":0},{"$f":"IF($K$1=1,D746,G746)","v":"there"},null,{"$f":"IF($K$1=1,IF(E746=\"\",\"\",E746),IF(H746=\"\",\"\",H746))","v":"(location)"},{"$f":"IF($K$1=1,G746,D746)","v":"dort"}]
[null,"33-Adverbs 1",{"$f":"IF(AND(LEFT(D747,1)=\"d\",MID(D747,4,1)=\" \"),RIGHT(D747,LEN(D747)-4),D747)","v":"noch"},"noch","(in the sense of \"yet\")",0,"still","(in the sense of \"yet\")",0,{"$f":"RAND()","v":0.9876516944041234},{"$f":"IF(Table24[[#This Row],[Type Here]]=\"\",\"\",IF(Table24[[#This Row],[Type Here]]=Table24[[#This Row],[Answer]],1,-2))","v":""},{"$f":"IF($K$1=1,Table24[[#This Row],[Strength1]],Table24[[#This Row],[Strength2]])","v":0},{"$f":"IF($K$1=1,D747,G747)","v":"still"},null,{"$f":"IF($K$1=1,IF(E747=\"\",\"\",E747),IF(H747=\"\",\"\",H747))","v":"(in the sense of \"yet\")"},{"$f":"IF($K$1=1,G747,D747)","v":"noch"}]
[null,"04-Food",{"$f":"IF(AND(LEFT(D748,1)=\"d\",MID(D748,4,1)=\" \"),RIGHT(D748,LEN(D748)-4),D748)","v":"Getränke"},"die Getränke",null,0,"drinks","noun",-2,{"$f":"RAND()","v":0.7336746306164615},{"$f":"IF(Table24[[#This Row],[Type Here]]=\"\",\"\",IF(Table24[[#This Row],[Type Here]]=Table24[[#This Row],[Answer]],1,-2))","v":""},{"$f":"IF($K$1=1,Table24[[#This Row],[Strength1]],Table24[[#This Row],[Strength2]])","v":-2},{"$f":"IF($K$1=1,D748,G748)","v":"drinks"},null,{"$f":"IF($K$1=1,IF(E748=\"\",\"\",E748),IF(H748=\"\",\"\",H748))","v":"noun"},{"$f":"IF($K$1=1,G748,D748)","v":"die Getränke"}]
[null,"14-Household",{"$f":"IF(AND(LEFT(D749,1)=\"d\",MID(D749,4,1)=\" \"),RIGHT(D749,LEN(D749)-4),D749)","v":"Treppen"},"die Treppen",null,0,"stairs","(staircases)",0,{"$f":"RAND()","v":0.6133874917255275},{"$f":"IF(Table24[[#This Row],[Type Here]]=\"\",\"\",IF(Table24[[#This Row],[Type Here]]=Table24[[#This Row],[Answer]],1,-2))","v":""},{"$f":"IF($K$1=1,Table24[[#This Row],[Strength1]],Table24[[#This Row],[Strength2]])","v":0},{"$f":"IF($K$1=1,D749,G749)","v":"stairs"},null,{"$f":"IF($K$1=1,IF(E749=\"\",\"\",E749),IF(H749=\"\",\"\",H749))","v":"(staircases)"},{"$f":"IF($K$1=1,G749,D749)","v":"die Treppen"}]
[null,"29-Medical",{"$f":"IF(AND(LEFT(D750,1)=\"d\",MID(D750,4,1)=\" \"),RIGHT(D750,LEN(D750)-4),D750)","v":"Hand"},"die Hand",null,0,"hand","anatomy",0,{"$f":"RAND()","v":0.6851139528473026},{"$f":"IF(Table24[[#This Row],[Type Here]]=\"\",\"\",IF(Table24[[#This Row],[Type Here]]=Table24[[#This Row],[Answer]],1,-2))","v":""},{"$f":"IF($K$1=1,Table24[[#This Row],[Strength1]],Table24[[#This Row],[Strength2]])","v":0},{"$f":"IF($K$1=1,D750,G750)","v":"hand"},null,{"$f":"IF($K$1=1,IF(E750=\"\",\"\",E750),IF(H750=\"\",\"\",H750))","v":"anatomy"},{"$f":"IF($K$1=1,G750,D750)","v":"die Hand"}]
[null,"04-Food",{"$f":"IF(AND(LEFT(D751,1)=\"d\",MID(D751,4,1)=\" \"),RIGHT(D751,LEN(D751)-4),D751)","v":"Vegetarierin"},"die Vegetarierin",null,0,"vegetarian","female",3,{"$f":"RAND()","v":0.8846336591310955},{"$f":"IF(Table24[[#This Row],[Type Here]]=\"\",\"\",IF(Table24[[#This Row],[Type Here]]=Table24[[#This Row],[Answer]],1,-2))","v":""},{"$f":"IF($K$1=1,Table24[[#This Row],[Strength1]],Table24[[#This Row],[Strength2]])","v":3},{"$f":"IF($K$1=1,D751,G751)","v":"vegetarian"},null,{"$f":"IF($K$1=1,IF(E751=\"\",\"\",E751),IF(H751=\"\",\"\",H751))","v":"female"},{"$f":"IF($K$1=1,G751,D751)","v":"die Vegetarierin"}]
[null,"36-Nature",{"$f":"IF(AND(LEFT(D752,1)=\"d\",MID(D752,4,1)=\" \"),RIGHT(D752,LEN(D752)-4),D752)","v":"Gold"},"das Gold",null,0,"gold",null,6,{"$f":"RAND()","v":0.8330257938941377},{"$f":"IF(Table24[[#This Row],[Type Here]]=\"\",\"\",IF(Table24[[#This Row],[Type Here]]=Table24[[#This Row],[Answer]],1,-2))","v":""},{"$f":"IF($K$1=1,Table24[[#This Row],[Strength1]],Table24[[#This Row],[Strength2]])","v":6},{"$f":"IF($K$1=1,D752,G752)","v":"gold"},null,{"$f":"IF($K$1=1,IF(E752=\"\",\"\",E752),IF(H752=\"\",\"\",H752))","v":""},{"$f":"IF($K$1=1,G752,D752)","v":"das Gold"}]
[null,"39-Adj: Acc.",{"$f":"IF(AND(LEFT(D753,1)=\"d\",MID(D753,4,1)=\" \"),RIGHT(D753,LEN(D753)-4),D753)","v":"ganz"},"ganz",null,0,"whole","(entire)",10,{"$f":"RAND()","v":0.3704863102621966},{"$f":"IF(Table24[[#This Row],[Type Here]]=\"\",\"\",IF(Table24[[#This Row],[Type Here]]=Table24[[#This Row],[Answer]],1,-2))","v":""},{"$f":"IF($K$1=1,Table24[[#This Row],[Strength1]],Table24[[#This Row],[Strength2]])","v":10},{"$f":"IF($K$1=1,D753,G753)","v":"whole"},null,{"$f":"IF($K$1=1,IF(E753=\"\",\"\",E753),IF(H753=\"\",\"\",H753))","v":"(entire)"},{"$f":"IF($K$1=1,G753,D753)","v":"ganz"}]
[null,"38-Ad: Nom. 1",{"$f":"IF(AND(LEFT(D754,1)=\"d\",MID(D754,4,1)=\" \"),RIGHT(D754,LEN(D754)-4),D754)","v":"übrig"},"übrig",null,0,"other","(remaining, spare)",3,{"$f":"RAND()","v":0.5850934203978796},{"$f":"IF(Table24[[#This Row],[Type Here]]=\"\",\"\",IF(Table24[[#This Row],[Type Here]]=Table24[[#This Row],[Answer]],1,-2))","v":""},{"$f":"IF($K$1=1,Table24[[#This Row],[Strength1]],Table24[[#This Row],[Strength2]])","v":3},{"$f":"IF($K$1=1,D754,G754)","v":"other"},null,{"$f":"IF($K$1=1,IF(E754=\"\",\"\",E754),IF(H754=\"\",\"\",H754))","v":"(remaining, spare)"},{"$f":"IF($K$1=1,G754,D754)","v":"übrig"}]
[null,"10-Nom. Pron.",{"$f":"IF(AND(LEFT(D755,1)=\"d\",MID(D755,4,1)=\" \"),RIGHT(D755,LEN(D755)-4),D755)","v":"welche"},"welche",null,0,"which",null,1,{"$f":"RAND()","v":0.4598059277418337},{"$f":"IF(Table24[[#This Row],[Type Here]]=\"\",\"\",IF(Table24[[#This Row],[Type Here]]=Table24[[#This Row],[Answer]],1,-2))","v":""},{"$f":"IF($K$1=1,Table24[[#This Row],[Strength1]],Table24[[#This Row],[Strength2]])","v":1},{"$f":"IF($K$1=1,D755,G755)","v":"which"},null,{"$f":"IF($K$1=1,IF(E755=\"\",\"\",E755),IF(H755=\"\",\"\",H755))","v":""},{"$f":"IF($K$1=1,G755,D755)","v":"welche"}]
[null,"04-Food",{"$f":"IF(AND(LEFT(D756,1)=\"d\",MID(D756,4,1)=\" \"),RIGHT(D756,LEN(D756)-4),D756)","v":"Biere"},"die Biere",null,0,"beers",null,0,{"$f":"RAND()","v":0.8475631787284297},{"$f":"IF(Table24[[#This Row],[Type Here]]=\"\",\"\",IF(Table24[[#This Row],[Type Here]]=Table24[[#This Row],[Answer]],1,-2))","v":""},{"$f":"IF($K$1=1,Table24[[#This Row],[Strength1]],Table24[[#This Row],[Strength2]])","v":0},{"$f":"IF($K$1=1,D756,G756)","v":"beers"},null,{"$f":"IF($K$1=1,IF(E756=\"\",\"\",E756),IF(H756=\"\",\"\",H756))","v":""},{"$f":"IF($K$1=1,G756,D756)","v":"die Biere"}]
[null,"33-Adverbs 1",{"$f":"IF(AND(LEFT(D757,1)=\"d\",MID(D757,4,1)=\" \"),RIGHT(D757,LEN(D757)-4),D757)","v":"selbst ich"},"selbst ich",null,0,"even I",null,0,{"$f":"RAND()","v":0.7975793826289147},{"$f":"IF(Table24[[#This Row],[Type Here]]=\"\",\"\",IF(Table24[[#This Row],[Type Here]]=Table24[[#This Row],[Answer]],1,-2))","v":""},{"$f":"IF($K$1=1,Table24[[#This Row],[Strength1]],Table24[[#This Row],[Strength2]])","v":0},{"$f":"IF($K$1=1,D757,G757)","v":"even I"},null,{"$f":"IF($K$1=1,IF(E757=\"\",\"\",E757),IF(H757=\"\",\"\",H757))","v":""},{"$f":"IF($K$1=1,G757,D757)","v":"selbst ich"}]
[null,"40-Places",{"$f":"IF(AND(LEFT(D758,1)=\"d\",MID(D758,4,1)=\" \"),RIGHT(D758,LEN(D758)-4),D758)","v":"Restaurant"},"das Restaurant",null,0,"restaurant",null,4,{"$f":"RAND()","v":0.8882152968901584},{"$f":"IF(Table24[[#This Row],[Type Here]]=\"\",\"\",IF(Table24[[#This Row],[Type Here]]=Table24[[#This Row],[Answer]],1,-2))","v":""},{"$f":"IF($K$1=1,Table24[[#This Row],[Strength1]],Table24[[#This Row],[Strength2]])","v":4},{"$f":"IF($K$1=1,D758,G758)","v":"restaurant"},null,{"$f":"IF($K$1=1,IF(E758=\"\",\"\",E758),IF(H758=\"\",\"\",H758))","v":""},{"$f":"IF($K$1=1,G758,D758)","v":"das Restaurant"}]
[null,"05-Animals",{"$f":"IF(AND(LEFT(D759,1)=\"d\",MID(D759,4,1)=\" \"),RIGHT(D759,LEN(D759)-4),D759)","v":"Insekt"},"das Insekt",null,0,"insect",null,1,{"$f":"RAND()","v":0.7189690257719197},{"$f":"IF(Table24[[#This Row],[Type Here]]=\"\",\"\",IF(Table24[[#This Row],[Type Here]]=Table24[[#This Row],[Answer]],1,-2))","v":""},{"$f":"IF($K$1=1,Table24[[#This Row],[Strength1]],Table24[[#This Row],[Strength2]])","v":1},{"$f":"IF($K$1=1,D759,G759)","v":"insect"},null,{"$f":"IF($K$1=1,IF(E759=\"\",\"\",E759),IF(H759=\"\",\"\",H759))","v":""},{"$f":"IF($K$1=1,G759,D759)","v":"das Insekt"}]
[null,"12-Acc. Pron.",{"$f":"IF(AND(LEFT(D760,1)=\"d\",MID(D760,4,1)=\" \"),RIGHT(D760,LEN(D760)-4),D760)","v":"ihn"},"ihn",null,null,"him","Accusative",null,{"$f":"RAND()","v":0.09572034916557082},{"$f":"IF(Table24[[#This Row],[Type Here]]=\"\",\"\",IF(Table24[[#This Row],[Type Here]]=Table24[[#This Row],[Answer]],1,-2))","v":""},{"$f":"IF($K$1=1,Table24[[#This Row],[Strength1]],Table24[[#This Row],[Strength2]])","v":0},{"$f":"IF($K$1=1,D760,G760)","v":"him"},null,{"$f":"IF($K$1=1,IF(E760=\"\",\"\",E760),IF(H760=\"\",\"\",H760))","v":"Accusative"},{"$f":"IF($K$1=1,G760,D760)","v":"ihn"}]
[null,"33-Adverbs 1",{"$f":"IF(AND(LEFT(D761,1)=\"d\",MID(D761,4,1)=\" \"),RIGHT(D761,LEN(D761)-4),D761)","v":"da"},"da","(place)",0,"there",null,1,{"$f":"RAND()","v":0.5493872148417557},{"$f":"IF(Table24[[#This Row],[Type Here]]=\"\",\"\",IF(Table24[[#This Row],[Type Here]]=Table24[[#This Row],[Answer]],1,-2))","v":""},{"$f":"IF($K$1=1,Table24[[#This Row],[Strength1]],Table24[[#This Row],[Strength2]])","v":1},{"$f":"IF($K$1=1,D761,G761)","v":"there"},null,{"$f":"IF($K$1=1,IF(E761=\"\",\"\",E761),IF(H761=\"\",\"\",H761))","v":""},{"$f":"IF($K$1=1,G761,D761)","v":"da"}]
[null,"14-Household",{"$f":"IF(AND(LEFT(D762,1)=\"d\",MID(D762,4,1)=\" \"),RIGHT(D762,LEN(D762)-4),D762)","v":"Balkone"},"die Balkone",null,0,"balconies",null,1,{"$f":"RAND()","v":0.3037592185970196},{"$f":"IF(Table24[[#This Row],[Type Here]]=\"\",\"\",IF(Table24[[#This Row],[Type Here]]=Table24[[#This Row],[Answer]],1,-2))","v":""},{"$f":"IF($K$1=1,Table24[[#This Row],[Strength1]],Table24[[#This Row],[Strength2]])","v":1},{"$f":"IF($K$1=1,D762,G762)","v":"balconies"},null,{"$f":"IF($K$1=1,IF(E762=\"\",\"\",E762),IF(H762=\"\",\"\",H762))","v":""},{"$f":"IF($K$1=1,G762,D762)","v":"die Balkone"}]
[null,"40-Places",{"$f":"IF(AND(LEFT(D763,1)=\"d\",MID(D763,4,1)=\" \"),RIGHT(D763,LEN(D763)-4),D763)","v":"Höfe"},"die Höfe",null,0,"courtyards",null,0,{"$f":"RAND()","v":0.4023057254835104},{"$f":"IF(Table24[[#This Row],[Type Here]]=\"\",\"\",IF(Table24[[#This Row],[Type Here]]=Table24[[#This Row],[Answer]],1,-2))","v":""},{"$f":"IF($K$1=1,Table24[[#This Row],[Strength1]],Table24[[#This Row],[Strength2]])","v":0},{"$f":"IF($K$1=1,D763,G763)","v":"courtyards"},null,{"$f":"IF($K$1=1,IF(E763=\"\",\"\",E763),IF(H763=\"\",\"\",H763))","v":""},{"$f":"IF($K$1=1,G763,D763)","v":"die Höfe"}]
[null,"07-Adjectives",{"$f":"IF(AND(LEFT(D764,1)=\"d\",MID(D764,4,1)=\" \"),RIGHT(D764,LEN(D764)-4),D764)","v":"richtig"},"richtig",null,0,"right","(correct)",3,{"$f":"RAND()","v":0.003284421106572455},{"$f":"IF(Table24[[#This Row],[Type Here]]=\"\",\"\",IF(Table24[[#This Row],[Type Here]]=Table24[[#This Row],[Answer]],1,-2))","v":""},{"$f":"IF($K$1=1,Table24[[#This Row],[Strength1]],Table24[[#This Row],[Strength2]])","v":3},{"$f":"IF($K$1=1,D764,G764)","v":"right"},null,{"$f":"IF($K$1=1,IF(E764=\"\",\"\",E764),IF(H764=\"\",\"\",H764))","v":"(correct)"},{"$f":"IF($K$1=1,G764,D764)","v":"richtig"}]

{"sheet":"List of Skills","index":1,"n_rows":56,"n_cols":6,"rows_kept":56}
[]
[null,null,"To be added when ready"]
[null,null,"11-Family","Family",null,11]
[null,null,"12-Acc. Pron.","Acc. Pron.",null,12]
[null,null,"13-Conjunct","Conjunct",null,13]
[null,null,"15-Questions","Questions",null,15]
[null,null,"16-Dat. Case","Dat. Case",null,16]
[null,null,"17-Numbers","Numbers",null,17]
[null,null,"18-Dat. Pron.","Dat. Pron.",null,18]
[null,null,"19-Negatives","Negatives",null,19]
[null,null,"20-People","People",null,20]
[null,null,"21-Travel","Travel",null,21]
[null,null,"23-Formal You","Formal You",null,23]
[null,null,"24-Occupation","Occupation",null,24]
[null,null,"25-Comparision","Comparision",null,25]
[null,null,"26-Qualifiers","Qualifiers",null,26]
[null,null,"27-A: Pred. 2","A: Pred. 2",null,27]
[null,null,"28-Prepos.","Prepos.",null,28]
[null,null,"30-V. Pres 2","V. Pres 2",null,30]
[null,null,"31-Dates & Time","Dates & Time",null,31]
[null,null,"32-Feelings","Feelings",null,32]
[null,null,"34-Freq","Freq",null,34]
[null,null,"35-V: Modal","V: Modal",null,35]
[null,null,"37-Gen. Case","Gen. Case",null,37]
[null,null,"41-Adj: Dat.","Adj: Dat.",null,41]
[null,null,"42-Ad: Nom. 2","Ad: Nom. 2",null,42]
[null,null,"43-Adverbs 2","Adverbs 2",null,43]
[null,null,"44-V: Pret.","V: Pret.",null,44]
[null,null,"45-Pres. Per","Pres. Per",null,45]
[null,"tree to here","46-Past Perf.","Past Perf.",null,46]
[null,null,"47-Objects","Objects",null,47]
[null,null,"48-Communic.","Communic.",null,48]
[null,null,"49-V: Fut. 1","V: Fut. 1",null,49]
[null,null,"50-Education","Education",null,50]
[null,null,"51-Science","Science",null,51]
[null,null,"52-Fut. Per.","Fut. Per.",null,52]
[null,null,"53-V: Refl.","V: Refl.",null,53]
[null,null,"54-Business 1","Business 1",null,54]
[null,null,"55-Language","Language",null,55]
[null,null,"56-Abs. Obj. 1","Abs. Obj. 1",null,56]
[null,null,"57-V. Pres. 3","V. Pres. 3",null,57]
[null,null,"58-V: Fut. 2","V: Fut. 2",null,58]
[null,null,"59-V. Cond","V. Cond",null,59]
[null,null,"60-Abs. Obj. 2","Abs. Obj. 2",null,60]
[null,null,"61-Cond. Per","Cond. Per",null,61]
[null,null,"62-Business 2","Business 2",null,62]
[null,null,"63-Sports","Sports",null,63]
[null,null,"64-Spiritual","Spiritual",null,64]
[null,null,"65-Arts","Arts",null,65]
[null,null,"66-Passive V.","Passive V.",null,66]
[null,null,"67-Imperative","Imperative",null,67]
[null,null,"68-Politics","Politics",null,68]
[null,null,"69-Ab. Obj. 3","Ab. Obj. 3",null,69]
[null,null,"70-Ab. Obj. 4","Ab. Obj. 4",null,70]
[null,null,"71-V. Cond 2","V. Cond 2",null,71]
[null,null,"72-V. Pres 4","V. Pres 4",null,72]

{"sheet":"WordListByLesson","index":2,"n_rows":1732,"n_cols":3,"rows_kept":1732}
[null,"Basics 1","x"]
[null,"Brot"]
[null,"das"]
[null,"der"]
[null,"den"]
[null,"die"]
[null,"du"]
[null,"ein"]
[null,"eine"]
[null,"einen"]
[null,"er"]
[null,"isst"]
[null,"esse"]
[null,"Frau"]
[null,"gut"]
[null,"ich"]
[null,"Junge"]
[null,"Kind"]
[null,"Mädchen"]
[null,"Mann"]
[null,"Milch"]
[null,"bist"]
[null,"bin"]
[null,"ist"]
[null,"sie"]
[null,"trinkst"]
[null,"trinkt"]
[null,"trinke"]
[null,"Wasser"]
[]
[null,"Basics 2","x"]
[null,"Buch"]
[null,"das"]
[null,"die"]
[null,"ein"]
[null,"eine"]
[null,"es"]
[null,"esst"]
[null,"essen"]
[null,"Frauen"]
[null,"hat"]
[null,"habe"]
[null,"habt"]
[null,"haben"]
[null,"hast"]
[null,"hat"]
[null,"ihr"]
[null,"Jungen"]
[null,"Kinder"]
[null,"lese"]
[null,"lesen"]
[null,"liest"]
[null,"Männer"]
[null,"sind"]
[null,"seid"]
[null,"sie"]
[null,"trinkt"]
[null,"trinken"]
[null,"wir"]
[null,"Zeitung"]
[]
[null,"Common Phrases","x"]
[null,"bald"]
[null,"bitte"]
[null,"danke"]
[null,"Entschuldigung"]
[null,"hallo"]
[null,"ja"]
[null,"leid"]
[null,"nein"]
[null,"nicht"]
[null,"tschüss"]
[null,"wiedersehen"]
[null,"willkommen"]
[]
[null,"Food","x"]
[null,"Abendessen"]
[null,"Apfel"]
[null,"Apfelsaft"]
[null,"Bier"]
[null,"Durst"]
[null,"Ei"]
[null,"Erdbeere"]
[null,"Essen"]
[null,"Fisch"]
[null,"Fleisch"]
[null,"Frühstück"]
[null,"Gemüse"]
[null,"Getränk"]
[null,"Hähnchen"]
[null,"Hunger"]
[null,"Kaffee"]
[null,"Kartoffel"]
[null,"Käse"]
[null,"Menü"]
[null,"Mittagessen"]
[null,"Nudeln"]
[null,"Obst"]
[null,"Orange"]
[null,"Orangensaft"]
[null,"Reis"]
[null,"Rezept"]
[null,"Saft"]
[null,"Salz"]
[null,"salzig"]
[null,"sauer"]
[null,"schmeckt"]
[null,"Schokolade"]
[null,"Speisekarte"]
[null,"Suppe"]
[null,"süß"]
[null,"Tee"]
[null,"Tomate"]
[null,"Vegetarier"]
[null,"Wein"]
[null,"Zitrone"]
[null,"Zucker"]
[]
[null,"Animals","x"]
[null,"Bär"]
[null,"Biene"]
[null,"Ente"]
[null,"Fliege"]
[null,"Haustier"]
[null,"Hund"]
[null,"Insekt"]
[null,"Katze"]
[null,"Kuh"]
[null,"Maus"]
[null,"Pferd"]
[null,"Tier"]
[null,"Vogel"]
[]
[null,"Plurals","x"]
[null,"Äpfel"]
[null,"Bücher"]
[null,"die"]
[null,"Eier"]
[null,"Fische"]
[null,"Hunde"]
[null,"Kartoffeln"]
[null,"Katzen"]
[null,"Mädchen"]
[null,"Menschen"]
[null,"Orangen"]
[null,"Tiere"]
[null,"Tomaten"]
[null,"Zeitungen"]
[]
[null,"Adjectives: Predicative","x"]
[null,"alt"]
[null,"einfach"]
[null,"fertig"]
[null,"fest"]
[null,"frei"]
[null,"früh"]
[null,"gemeinsam"]
[null,"genau"]
[null,"gesund"]
[null,"hoch"]
[null,"interessant"]
[null,"kalt"]
[null,"klar"]
[null,"kostenlos"]
[null,"kurz"]
[null,"langsam"]
[null,"möglich"]
[null,"neu"]
[null,"normal"]
[null,"nützlich"]
[null,"perfekt"]
[null,"positiv"]
[null,"praktisch"]
[null,"richtig"]
[null,"rund"]
[null,"schlecht"]
[null,"schnell"]
[null,"schön"]
[null,"schwer"]
[null,"stark"]
[null,"teuer"]
[null,"toll"]
[null,"voll"]
[null,"wahrscheinlich"]
[null,"weiß"]
[null,"wichtig"]
[]
[null,"Verbs: Present 1","x"]
[null,"beginnen"]
[null,"bezahlen"]
[null,"brauchen"]
[null,"bringen"]
[null,"gehen"]
[null,"kennen"]
[null,"laufen"]
[null,"lernen"]
[null,"lesen"]
[null,"mögen"]
[null,"reichen"]
[null,"rennen"]
[null,"schlafen"]
[null,"schreiben"]
[null,"schwimmen"]
[null,"sehen"]
[null,"spielen"]
[null,"sprechen"]
[null,"verpassen"]
[null,"waschen"]
[]
[null,"Clothing","x"]
[null,"Hemd"]
[null,"Hose"]
[null,"Hut"]
[null,"Jacke"]
[null,"Kleid"]
[null,"Kleidung"]
[null,"Knopf"]
[null,"Kosmetik"]
[null,"Leder"]
[null,"Mantel"]
[null,"Rock"]
[null,"Schmuck"]
[null,"Schuh"]
[null,"Tasche"]
[null,"tragen"]
[]
[null,"Nominative Pronouns","x"]
[null,"alle"]
[null,"beide"]
[null,"das"]
[null,"dein"]
[null,"deine"]
[null,"dies"]
[null,"euer"]
[null,"ihr"]
[null,"jed"]
[null,"jemand"]
[null,"man"]
[null,"manch"]
[null,"meine"]
[null,"mein"]
[null,"niemand"]
[null,"sein"]
[null,"unser"]
[null,"viel"]
[null,"welch"]
[]
[null,"Family","11-Family"]
["11-Family","Beziehung"]
["11-Family","Bruder"]
["11-Family","Eltern"]
["11-Family","Familie"]
["11-Family","Geschwister"]
["11-Family","Großeltern"]
["11-Family","Großmutter"]
["11-Family","Großvater"]
["11-Family","Hochzeit"]
["11-Family","Mutter"]
["11-Family","Partner"]
["11-Family","Partnerschaft"]
["11-Family","Schwester"]
["11-Family","Sohn"]
["11-Family","Tochter"]
["11-Family","Vater"]
[]
["12-Acc. Pron.","Accusative Pronouns","12-Acc. Pron."]
["12-Acc. Pron.","alle"]
["12-Acc. Pron.","ander"]
["12-Acc. Pron.","das"]
["12-Acc. Pron.","dein"]
["12-Acc. Pron.","dies"]
["12-Acc. Pron.","dich"]
["12-Acc. Pron.","ihn"]
["12-Acc. Pron.","es"]
["12-Acc. Pron.","euer"]
["12-Acc. Pron.","mich"]
["12-Acc. Pron.","ihr"]
["12-Acc. Pron.","euch"]
["12-Acc. Pron.","jed"]
["12-Acc. Pron.","mein"]
["12-Acc. Pron.","sein"]
["12-Acc. Pron.","sie"]
["12-Acc. Pron.","unser"]
["12-Acc. Pron.","viel"]
["12-Acc. Pron.","welch"]
["12-Acc. Pron.","uns"]
[]
["13-Conjunct","Conjunctions","13-Conjunct"]
["13-Conjunct","aber"]
["13-Conjunct","da"]
["13-Conjunct","doch"]
["13-Conjunct","entweder"]
["13-Conjunct","nachdem"]
["13-Conjunct","obwohl"]
["13-Conjunct","oder"]
["13-Conjunct","sobald"]
["13-Conjunct","sofern"]
["13-Conjunct","solange"]
["13-Conjunct","sowie"]
["13-Conjunct","und"]
["13-Conjunct","wenn"]
["13-Conjunct","wie"]
[]
[null,"Household","x"]
[null,"Bad"]
[null,"Balkon"]
[null,"Batterie"]
[null,"Bau"]
[null,"Bett"]
[null,"Bett+bezug"]
[null,"Dach"]
[null,"Fenster"]
[null,"Flasche"]
[null,"Gerät"]
[null,"Glas"]
[null,"Haus"]
[null,"Haushalt"]
[null,"Haushalt+gerät"]
[null,"Heizung"]
[null,"Keller"]
[null,"Küche"]
[null,"Lampe"]
[null,"Leiter"]
[null,"Licht"]
[null,"Löffel"]
[null,"Möbel"]
[null,"Öl"]
[null,"Rasierer"]
[null,"Raum"]
[null,"Regen+schirm"]
[null,"Reinigung"]
[null,"Schlaf"]
[null,"Schlaf+zimmer"]
[null,"Schlüssel"]
[null,"Schüssel"]
[null,"Seife"]
[null,"Sofa"]
[null,"Spiegel"]
[null,"Spielzeug"]
[null,"Stuhl"]
[null,"Tasse"]
[null,"Teller"]
[null,"Tisch"]
[null,"Toilette"]
[null,"Tor"]
[null,"Treppe"]
[null,"Tür"]
[null,"Umzug"]
[null,"Wand"]
[null,"Werkzeug"]
[null,"Wohnen+ort"]
[null,"Wohnung"]
[null,"Zahn+bürste"]
[null,"Zahnpasta"]
[]
[null,"Questions","15-Questions"]
["15-Questions","Antwort"]
["15-Questions","Frage"]
["15-Questions","wann"]
["15-Questions","warum"]
["15-Questions","was"]
["15-Questions","wer"]
["15-Questions","wieso"]
["15-Questions","wieviel"]
["15-Questions","wo"]
["15-Questions","wofür"]
["15-Questions","wohin"]
["15-Questions","worüber"]
[]
[null,"Dative Case","16-Dat. Case"]
["16-Dat. Case","am"]
["16-Dat. Case","am"]
["16-Dat. Case","auf"]
["16-Dat. Case","aus"]
["16-Dat. Case","bei"]
["16-Dat. Case","beim"]
["16-Dat. Case","dem"]
["16-Dat. Case","dem"]
["16-Dat. Case","den"]
["16-Dat. Case","der"]
["16-Dat. Case","einer"]
["16-Dat. Case","einem"]
["16-Dat. Case","mit"]
["16-Dat. Case","nach"]
["16-Dat. Case","zu"]
["16-Dat. Case","zum"]
["16-Dat. Case","zum"]
["16-Dat. Case","zur"]
[]
[null,"Numbers","17-Numbers"]
["17-Numbers","acht"]
["17-Numbers","drei"]
["17-Numbers","dritt"]
["17-Numbers","eins"]
["17-Numbers","erst"]
["17-Numbers","etwas"]
["17-Numbers","fünf"]
["17-Numbers","Hälfte"]
["17-Numbers","Liter"]
["17-Numbers","Maß"]
["17-Numbers","Meter"]
["17-Numbers","Milliarde"]
["17-Numbers","Million"]
["17-Numbers","neun"]
["17-Numbers","Nummer"]
["17-Numbers","Paar"]
["17-Numbers","paar"]
["17-Numbers","Prozent"]
["17-Numbers","sechs"]
["17-Numbers","sieben"]
["17-Numbers","Summe"]
["17-Numbers","Telefon+nummer"]
["17-Numbers","vier"]
["17-Numbers","Zahl"]
["17-Numbers","zehn"]
["17-Numbers","zwei"]
["17-Numbers","zweite"]
["17-Numbers","zweit"]
["17-Numbers","zwölf"]
[]
[null,"Dative Pronouns","18-Dat. Pron."]
["18-Dat. Pron.","beide"]
["18-Dat. Pron.","danken"]
["18-Dat. Pron.","dein"]
["18-Dat. Pron.","dies"]
["18-Dat. Pron.","dir"]
["18-Dat. Pron.","ihm"]
["18-Dat. Pron.","folgen"]
["18-Dat. Pron.","gehören"]
["18-Dat. Pron.","helfen"]
["18-Dat. Pron.","mir"]
["18-Dat. Pron.","ihr"]
["18-Dat. Pron.","euch"]
["18-Dat. Pron.","meiner"]
["18-Dat. Pron.","meinen"]
["18-Dat. Pron.","meinem"]
["18-Dat. Pron.","sein"]
["18-Dat. Pron.","ihr"]
["18-Dat. Pron.","ihnen"]
["18-Dat. Pron.","unser"]
["18-Dat. Pron.","viel"]
["18-Dat. Pron.","welch"]
["18-Dat. Pron.","uns"]
[]
[null,"Negatives","19-Negatives"]
["19-Negatives","kein"]
["19-Negatives","keine"]
["19-Negatives","keiner"]
["19-Negatives","keinen"]
["19-Negatives","nicht"]
["19-Negatives","nichts"]
["19-Negatives","nie"]
["19-Negatives","niemals"]
[]
[null,"People","20-People"]
["20-People","Anfänger"]
["20-People","Baby"]
["20-People","Besucher"]
["20-People","Bevölkerung"]
["20-People","Bürger"]
["20-People","Dame"]
["20-People","Deutsch"]
["20-People","deutsch"]
["20-People","Einwohner"]
["20-People","englisch"]
["20-People","Englisch"]
["20-People","Erwachsene"]
["20-People","Fan"]
["20-People","Französisch"]
["20-People","Frau"]
["20-People","Freund"]
["20-People","Freundin"]
["20-People","Gast"]
["20-People","Gegner"]
["20-People","Gemeinde"]
["20-People","Geschlecht"]
["20-People","Gruppe"]
["20-People","Heimwerker"]
["20-People","Herr"]
["20-People","Integration"]
["20-People","Junge"]
["20-People","Käufer"]
["20-People","Kind"]
["20-People","Leute"]
["20-People","Mann"]
["20-People","Mannschaft"]
["20-People","Mensch"]
["20-People","Mitglied"]
["20-People","Mitgliedschaft"]
["20-People","Name"]
["20-People","Nutzer"]
["20-People","Öffentlichkeit"]
["20-People","Person"]
["20-People","Personal"]
["20-People","Publikum"]
["20-People","Verbindung"]
["20-People","Verbraucher"]
["20-People","Verein"]
["20-People","Verhältnis"]
["20-People","Vorname"]
[]
[null,"Travel","21-Travel"]
["21-Travel","Abenteuer"]
["21-Travel","Afrika"]
["21-Travel","Auto"]
["21-Travel","Bahn"]
["21-Travel","Bayern"]
["21-Travel","Besuch"]
["21-Travel","Boot"]
["21-Travel","Bus"]
["21-Travel","Bus+halt+stelle"]
["21-Travel","Deutschland"]
["21-Travel","Fahrt"]
["21-Travel","Fahrzeug"]
["21-Travel","Ferien"]
["21-Travel","Flug"]
["21-Travel","Frankreich"]
["21-Travel","Großbritannien"]
["21-Travel","Hamburg"]
["21-Travel","Italien"]
["21-Travel","Mieten+wagen"]
["21-Travel","Motorrad"]
["21-Travel","Österreich"]
["21-Travel","Pass"]
["21-Travel","Ratgeber"]
["21-Travel","Reise"]
["21-Travel","Schweden"]
["21-Travel","Schweiz"]
["21-Travel","Schweizer"]
["21-Travel","Sehenswürdigkeit"]
["21-Travel","Spanien"]
["21-Travel","Stadt+plan"]
["21-Travel","Strecke"]
["21-Travel","Tour"]
["21-Travel","Tourismus"]
["21-Travel","Transport"]
["21-Travel","Verkehr"]
["21-Travel","Weg"]
["21-Travel","Wien"]
["21-Travel","Zug"]
[]
[null,"Colors","x"]
[null,"blau"]
[null,"Farbe"]
[null,"gelb"]
[null,"grün"]
[null,"grünen"]
[null,"rot"]
[null,"rote"]
[null,"Rot"]
[null,"schwarz"]
[null,"schwarze"]
[null,"weiß"]
[]
[null,"Formal You","23-Formal You"]
["23-Formal You","sie"]
["23-Formal You","ihnen"]
[]
[null,"Occupations","24-Occupation"]
["24-Occupation","der Arbeitgeber","M"]
[null,"die Arbeitgeber","M PL"]
["24-Occupation","die Arbeitgeberin","F"]
["24-Occupation","der Arbeitnehmer","M"]
[null,"die Arbeitnehmer","M PL"]
[null,"die Arbeitnehmerin","F"]
["24-Occupation","Architekt"]
["24-Occupation","Arzt"]
["24-Occupation","Ärztin"]
["24-Occupation","Autor"]
["24-Occupation","Bauer"]
["24-Occupation","Bedienung"]
["24-Occupation","Beruf"]
["24-Occupation","Betreiber"]
["24-Occupation","Bürgermeister"]
["24-Occupation","Empfänger"]
["24-Occupation","Entwickler"]
["24-Occupation","Experte"]
["24-Occupation","Fahrer"]
["24-Occupation","Feuerwehr"]
["24-Occupation","Geschäfts+führer"]
["24-Occupation","Hand+werk"]
["24-Occupation","Händler"]
["24-Occupation","Hersteller"]
["24-Occupation","Koch"]
["24-Occupation","Lehrer"]
["24-Occupation","Lehrerin"]
["24-Occupation","Leiter"]
["24-Occupation","Leiterin"]
["24-Occupation","Meister"]
["24-Occupation","Mitarbeiter"]
["24-Occupation","Mitarbeiterin"]
["24-Occupation","Professor"]
["24-Occupation","Professorin"]
["24-Occupation","Rechts+anwalt"]
["24-Occupation","Reiseführer"]
["24-Occupation","Richter"]
["24-Occupation","Schneider"]
["24-Occupation","Schüler"]
["24-Occupation","Schülerin"]
["24-Occupation","Senior"]
["24-Occupation","Spezialität"]
["24-Occupation","Student"]
["24-Occupation","Studentin"]
["24-Occupation","Teilnehmer"]
["24-Occupation","Trainer"]
["24-Occupation","Verfasser"]
["24-Occupation","Verkäufer"]
["24-Occupation","Weber"]
["24-Occupation","Werkstatt"]
[]
[null,"Comparisons","25-Comparision"]
["25-Comparision","klein"]
["25-Comparision","Größe"]
["25-Comparision","großen"]
["25-Comparision","groß"]
["25-Comparision","große"]
["25-Comparision","größere"]
["25-Comparision","größer"]
[]
[null,"Qualifiers","26-Qualifiers"]
["26-Qualifiers","eher"]
["26-Qualifiers","ganz"]
["26-Qualifiers","gewöhnlich"]
["26-Qualifiers","gut"]
["26-Qualifiers","besten"]
["26-Qualifiers","bessere"]
["26-Qualifiers","sehr"]
["26-Qualifiers","super"]
["26-Qualifiers","ziemlich"]
[]
[null,"Adjectives: Predicative 2","27-A: Pred. 2"]
["27-A: Pred. 2","abhängig"]
["27-A: Pred. 2","ähnlich"]
["27-A: Pred. 2","aktiv"]
["27-A: Pred. 2","allgemein"]
["27-A: Pred. 2","ausgezeichnet"]
["27-A: Pred. 2","automatisch"]
["27-A: Pred. 2","begeistert"]
["27-A: Pred. 2","beliebt"]
["27-A: Pred. 2","bereit"]
["27-A: Pred. 2","deutlich"]
["27-A: Pred. 2","echt"]
["27-A: Pred. 2","egal"]
["27-A: Pred. 2","eindeutig"]
["27-A: Pred. 2","erneut"]
["27-A: Pred. 2","extrem"]
["27-A: Pred. 2","falsch"]
["27-A: Pred. 2","fit"]
["27-A: Pred. 2","besser"]
["27-A: Pred. 2","herzlich"]
["27-A: Pred. 2","hilfreich"]
["27-A: Pred. 2","höher"]
["27-A: Pred. 2","individuell"]
["27-A: Pred. 2","international"]
["27-A: Pred. 2","jährlich"]
["27-A: Pred. 2","jung"]
["27-A: Pred. 2","kaputt"]
["27-A: Pred. 2","kleiner"]
["27-A: Pred. 2","knapp"]
["27-A: Pred. 2","komplett"]
["27-A: Pred. 2","kürzlich"]
["27-A: Pred. 2","länger"]
["27-A: Pred. 2","langsamer"]
["27-A: Pred. 2","leicht"]
["27-A: Pred. 2","leichter"]
["27-A: Pred. 2","müde"]
["27-A: Pred. 2","notwendig"]
["27-A: Pred. 2","offen"]
["27-A: Pred. 2","original"]
["27-A: Pred. 2","persönlich"]
["27-A: Pred. 2","plötzlich"]
["27-A: Pred. 2","privat"]
["27-A: Pred. 2","regional"]
["27-A: Pred. 2","relativ"]
["27-A: Pred. 2","ruhig"]
["27-A: Pred. 2","schöner"]
["27-A: Pred. 2","selbstverständlich"]
["27-A: Pred. 2","sichtbar"]
["27-A: Pred. 2","sinnvoll"]
["27-A: Pred. 2","stärker"]
["27-A: Pred. 2","täglich"]
["27-A: Pred. 2","tatsächlich"]
["27-A: Pred. 2","unabhängig"]
["27-A: Pred. 2","unbekannt"]
["27-A: Pred. 2","verantwortlich"]
["27-A: Pred. 2","verfügbar"]
["27-A: Pred. 2","verpflichtet"]
["27-A: Pred. 2","völlig"]
["27-A: Pred. 2","wert"]
["27-A: Pred. 2","wesentlich"]
["27-A: Pred. 2","wichtiger"]
["27-A: Pred. 2","wirklich"]
["27-A: Pred. 2","zufrieden"]
["27-A: Pred. 2","zuständig"]
[]
[null,"Prepositions","28-Prepos."]
["28-Prepos.","ab"]
["28-Prepos.","an"]
["28-Prepos.","auf"]
["28-Prepos.","aufs"]
["28-Prepos.","außer"]
["28-Prepos.","beim"]
["28-Prepos.","bis"]
["28-Prepos.","durch"]
["28-Prepos.","einschließlich"]
["28-Prepos.","extra"]
["28-Prepos.","für"]
["28-Prepos.","gegen"]
["28-Prepos.","gegenüber"]
["28-Prepos.","hinter"]
["28-Prepos.","in"]
["28-Prepos.","im"]
["28-Prepos.","ins"]
["28-Prepos.","im"]
["28-Prepos.","neben"]
["28-Prepos.","ohne"]
["28-Prepos.","seit"]
["28-Prepos.","trotz"]
["28-Prepos.","über"]
["28-Prepos.","um"]
["28-Prepos.","ums"]
["28-Prepos.","unter"]
["28-Prepos.","von"]
["28-Prepos.","vom"]
["28-Prepos.","vom"]
["28-Prepos.","vor"]
["28-Prepos.","während"]
["28-Prepos.","wegen"]
["28-Prepos.","zwischen"]
[]
[null,"Medical"]
[null,"Alkohol"]
[null,"Apotheke"]
[null,"Auge"]
[null,"Bein"]
[null,"Blut"]
[null,"Diät"]
[null,"Ernährung"]
[null,"Finger"]
[null,"Formular"]
[null,"Fuß"]
[null,"Geburt"]
[null,"Gesicht"]
[null,"Gesundheit"]
[null,"Haar"]
[null,"Hals"]
[null,"Hand"]
[null,"Haut"]
[null,"Herz"]
[null,"Klinik"]
[null,"Kopf"]
[null,"Körper"]
[null,"krank"]
[null,"Kranke+versicherung"]
[null,"Kranke+wagen"]
[null,"Krankenhaus"]
[null,"Krankheit"]
[null,"Medikament"]
[null,"Medizin"]
[null,"Notfall"]
[null,"Opfer"]
[null,"Patient"]
[null,"Pflege"]
[null,"Praxis"]
[null,"Sucht"]
[null,"Therapie"]
[null,"Unfall"]
[null,"Untersuchung"]
[]
[null,"Verbs: Present 2","30-V. Pres 2"]
["30-V. Pres 2","abonnieren"]
["30-V. Pres 2","akzeptieren"]
["30-V. Pres 2","ändern"]
["30-V. Pres 2","arbeiten"]
["30-V. Pres 2","benutzen"]
["30-V. Pres 2","bestellen"]
["30-V. Pres 2","bleiben"]
["30-V. Pres 2","erkennen"]
["30-V. Pres 2","erlauben"]
["30-V. Pres 2","ersetzen"]
["30-V. Pres 2","erweitern"]
["30-V. Pres 2","fahren"]
["30-V. Pres 2","fehlen"]
["30-V. Pres 2","finden"]
["30-V. Pres 2","funktionieren"]
["30-V. Pres 2","geben"]
["30-V. Pres 2","gefallen"]
["30-V. Pres 2","gehen"]
["30-V. Pres 2","glauben"]
["30-V. Pres 2","halten"]
["30-V. Pres 2","hoffen"]
["30-V. Pres 2","hören"]
["30-V. Pres 2","kochen"]
["30-V. Pres 2","kommen"]
["30-V. Pres 2","kosten"]
["30-V. Pres 2","liegen"]
["30-V. Pres 2","machen"]
["30-V. Pres 2","meinen"]
["30-V. Pres 2","mögen"]
["30-V. Pres 2","nehmen"]
["30-V. Pres 2","passieren"]
["30-V. Pres 2","prüfen"]
["30-V. Pres 2","sammeln"]
["30-V. Pres 2","scheinen"]
["30-V. Pres 2","schließen"]
["30-V. Pres 2","schwimmen"]
["30-V. Pres 2","singen"]
["30-V. Pres 2","spazieren"]
["30-V. Pres 2","stehen"]
["30-V. Pres 2","stehlen"]
["30-V. Pres 2","steigen"]
["30-V. Pres 2","stellen"]
["30-V. Pres 2","suchen"]
["30-V. Pres 2","treffen"]
["30-V. Pres 2","übernehmen"]
["30-V. Pres 2","verkaufen"]
["30-V. Pres 2","warten"]
["30-V. Pres 2","wissen"]
["30-V. Pres 2","wohnen"]
["30-V. Pres 2","zeigen"]
[]
[null,"Dates and Time","31-Dates & Time"]
["31-Dates & Time","Abend"]
["31-Dates & Time","Alltag"]
["31-Dates & Time","Alter"]
["31-Dates & Time","April"]
["31-Dates & Time","August"]
["31-Dates & Time","Datum"]
["31-Dates & Time","Dauer"]
["31-Dates & Time","Dezember"]
["31-Dates & Time","Dienstag"]
["31-Dates & Time","Donnerstag"]
["31-Dates & Time","Ende"]
["31-Dates & Time","Februar"]
["31-Dates & Time","Freitag"]
["31-Dates & Time","Geburtstag"]
["31-Dates & Time","Herbst"]
["31-Dates & Time","Jahr"]
["31-Dates & Time","Jahrhundert"]
["31-Dates & Time","Januar"]
["31-Dates & Time","Juli"]
["31-Dates & Time","Juni"]
["31-Dates & Time","Kalender"]
["31-Dates & Time","letzt"]
["31-Dates & Time","Mai"]
["31-Dates & Time","März"]
["31-Dates & Time","Minute"]
["31-Dates & Time","Mittag"]
["31-Dates & Time","Mittwoch"]
["31-Dates & Time","Moment"]
["31-Dates & Time","Monat"]
["31-Dates & Time","Montag"]
["31-Dates & Time","Morgen"]
["31-Dates & Time","morgen"]
["31-Dates & Time","Nacht"]
["31-Dates & Time","November"]
["31-Dates & Time","Oktober"]
["31-Dates & Time","Phase"]
["31-Dates & Time","Quartal"]
["31-Dates & Time","Saison"]
["31-Dates & Time","Samstag"]
["31-Dates & Time","Schluss"]
["31-Dates & Time","Sekunde"]
["31-Dates & Time","September"]
["31-Dates & Time","Sommer"]
["31-Dates & Time","Sonntag"]
["31-Dates & Time","Stunde"]
["31-Dates & Time","Tag"]
["31-Dates & Time","Termin"]
["31-Dates & Time","Uhr"]
["31-Dates & Time","Uhr+zeit"]
["31-Dates & Time","Urlaub"]
["31-Dates & Time","Vergangenheit"]
["31-Dates & Time","Weihnachten"]
["31-Dates & Time","Werk+tag"]
["31-Dates & Time","Woche"]
["31-Dates & Time","Wochenende"]
["31-Dates & Time","Zeit"]
["31-Dates & Time","Zeit+punkt"]
["31-Dates & Time","Zeitraum"]
["31-Dates & Time","Zukunft"]
[]
[null,"Feelings","32-Feelings"]
["32-Feelings","Angst"]
["32-Feelings","Eindruck"]
["32-Feelings","Ernst"]
["32-Feelings","Freude"]
["32-Feelings","Gedanke"]
["32-Feelings","Glück"]
["32-Feelings","Humor"]
["32-Feelings","Liebe"]
["32-Feelings","Lust"]
["32-Feelings","Not"]
["32-Feelings","Ruhe"]
["32-Feelings","Spaß"]
["32-Feelings","Traum"]
["32-Feelings","träumen"]
["32-Feelings","unheimlich"]
["32-Feelings","Verständnis"]
["32-Feelings","Witz"]
["32-Feelings","witzig"]
["32-Feelings","Wunsch"]
[]
[null,"Adverbs 1"]
[null,"allein"]
[null,"auch"]
[null,"außerdem"]
[null,"bereits"]
[null,"besonders"]
[null,"da"]
[null,"dabei"]
[null,"daher"]
[null,"damit"]
[null,"danach"]
[null,"dann"]
[null,"darüber"]
[null,"dazu"]
[null,"dennoch"]
[null,"dort"]
[null,"durchaus"]
[null,"einmal"]
[null,"etwa"]
[null,"fast"]
[null,"genauso"]
[null,"gern"]
[null,"gerne"]
[null,"gestern"]
[null,"heute"]
[null,"hier"]
[null,"hingegen"]
[null,"immer"]
[null,"innen"]
[null,"je"]
[null,"jedenfalls"]
[null,"jedoch"]
[null,"jetzt"]
[null,"kaum"]
[null,"meistens"]
[null,"mindestens"]
[null,"noch"]
[null,"nun"]
[null,"nur"]
[null,"oben"]
[null,"schon"]
[null,"selber"]
[null,"selbst"]
[null,"so"]
[null,"sofort"]
[null,"somit"]
[null,"sonst"]
[null,"spätestens"]
[null,"überhaupt"]
[null,"weder"]
[null,"weg"]
[null,"wieder"]
[null,"zuerst"]
[null,"zuletzt"]
[]
[null,"Frequency","34-Freq"]
["34-Freq","als"]
["34-Freq","bisschen"]
["34-Freq","groß"]
["34-Freq","häufig"]
["34-Freq","keinerlei"]
["34-Freq","Mal"]
["34-Freq","manchmal"]
["34-Freq","mehr"]
["34-Freq","mehr"]
["34-Freq","meist"]
["34-Freq","ob"]
["34-Freq","oft"]
["34-Freq","selten"]
["34-Freq","sondern"]
["34-Freq","sowohl"]
["34-Freq","wenig"]
["34-Freq","weniger"]
["34-Freq","zahlreich"]
[]
[null,"Verbs: Modal","35-V: Modal"]
["35-V: Modal","aussagen"]
["35-V: Modal","benutzen"]
["35-V: Modal","bestätigen"]
["35-V: Modal","betrachten"]
["35-V: Modal","bezahlen"]
["35-V: Modal","dass"]
["35-V: Modal","dürfen"]
["35-V: Modal","entscheiden"]
["35-V: Modal","ersetzen"]
["35-V: Modal","essen"]
["35-V: Modal","finden"]
["35-V: Modal","formen"]
["35-V: Modal","fragen"]
["35-V: Modal","gehen"]
["35-V: Modal","helfen"]
["35-V: Modal","hören"]
["35-V: Modal","kochen"]
["35-V: Modal","können"]
["35-V: Modal","lernen"]
["35-V: Modal","lesen"]
["35-V: Modal","machen"]
["35-V: Modal","mieten"]
["35-V: Modal","mitmachen"]
["35-V: Modal","mögen"]
["35-V: Modal","müssen"]
["35-V: Modal","öffnen"]
["35-V: Modal","reden"]
["35-V: Modal","registrieren"]
["35-V: Modal","sagen"]
["35-V: Modal","schlafen"]
["35-V: Modal","schwimmen"]
["35-V: Modal","sehen"]
["35-V: Modal","sollen"]
["35-V: Modal","spazieren"]
["35-V: Modal","sprechen"]
["35-V: Modal","teilnehmen"]
["35-V: Modal","tun"]
["35-V: Modal","vorstellen"]
["35-V: Modal","wecken"]
["35-V: Modal","wiederholen"]
["35-V: Modal","wollen"]
["35-V: Modal","wünschen"]
["35-V: Modal","zeigen"]
[]
[null,"Nature"]
[null,"All"]
[null,"Atmosphäre"]
[null,"Baum"]
[null,"Berg"]
[null,"Blume"]
[null,"Chemie"]
[null,"Erde"]
[null,"Feuer"]
[null,"Garten"]
[null,"Gold"]
[null,"Gras"]
[null,"Himmel"]
[null,"Holz"]
[null,"Klima"]
[null,"Luft"]
[null,"Meer"]
[null,"Metall"]
[null,"Mond"]
[null,"Natur"]
[null,"Pflanze"]
[null,"Regen"]
[null,"Rhein"]
[null,"See"]
[null,"Sonne"]
[null,"Stahl"]
[null,"Stein"]
[null,"Stern"]
[null,"Strand"]
[null,"Strom"]
[null,"Tier+welt"]
[null,"Umwelt"]
[null,"Wald"]
[null,"Wasser"]
[null,"Welt"]
[null,"Wetter"]
[null,"Wiese"]
[null,"Wind"]
[]
[null,"Genitive Case","37-Gen. Case"]
["37-Gen. Case","des"]
["37-Gen. Case","dein"]
["37-Gen. Case","des"]
["37-Gen. Case","dessen"]
["37-Gen. Case","die"]
["37-Gen. Case","dies"]
["37-Gen. Case","ihr"]
["37-Gen. Case","mein"]
["37-Gen. Case","sein"]
[]
[null,"Adjectives: Nominative 1","x"]
[null,"aktuelle"]
[null,"alte"]
[null,"besonderen"]
[null,"eigener"]
[null,"einzelnen"]
[null,"europäischen"]
[null,"externer"]
[null,"gesamte"]
[null,"größten"]
[null,"größte"]
[null,"höheren"]
[null,"hoher"]
[null,"hohen"]
[null,"hohe"]
[null,"individuellen"]
[null,"interessante"]
[null,"internationalen"]
[null,"internationale"]
[null,"jugendliche"]
[null,"jugendlichen"]
[null,"kostenlosen"]
[null,"letzter"]
[null,"linken"]
[null,"müde"]
[null,"nächster"]
[null,"neues"]
[null,"neuen"]
[null,"normalen"]
[null,"notwendigen"]
[null,"öffentlichen"]
[null,"öffentliche"]
[null,"passende"]
[null,"passenden"]
[null,"private"]
[null,"richtige"]
[null,"speziellen"]
[null,"übrigen"]
[null,"voller"]
[null,"weiterer"]
[null,"wichtigsten"]
[null,"wichtigen"]
[null,"zufälliger"]
[null,"zusätzliche"]
[]
[null,"Adjectives: Accusative","x"]
[null,"alte"]
[null,"detaillierte"]
[null,"deutschen"]
[null,"ehemaligen"]
[null,"eigenen"]
[null,"eigene"]
[null,"einzige"]
[null,"ganzen"]
[null,"gemeinsame"]
[null,"gleiche"]
[null,"höhere"]
[null,"hohe"]
[null,"komplette"]
[null,"kostenlose"]
[null,"langen"]
[null,"lange"]
[null,"modernen"]
[null,"nahe"]
[null,"nächsten"]
[null,"neue"]
[null,"neues"]
[null,"neuen"]
[null,"normalen"]
[null,"offenen"]
[null,"persönlichen"]
[null,"starken"]
[null,"technischen"]
[null,"verfügbaren"]
[null,"vergangenen"]
[null,"verschiedenen"]
[null,"verschiedene"]
[null,"weitere"]
[null,"weiteres"]
[null,"wesentlichen"]
[null,"wichtige"]
[null,"zuständigen"]
[null,"zweite"]
[]
[null,"Places"]
[null,"Ausland"]
[null,"Bahnhof"]
[null,"Bar"]
[null,"Bereich"]
[null,"Bezirk"]
[null,"Brücke"]
[null,"Bundesland"]
[null,"City"]
[null,"Club"]
[null,"Dorf"]
[null,"entlang"]
[null,"Europa"]
[null,"Ferien+haus"]
[null,"Fläche"]
[null,"Flughafen"]
[null,"Gebäude"]
[null,"Grund"]
[null,"Grundstück"]
[null,"Halle"]
[null,"Heimat"]
[null,"Hof"]
[null,"Hotel"]
[null,"Innere"]
[null,"Insel"]
[null,"Land"]
[null,"Land+kreis"]
[null,"links"]
[null,"Norden"]
[null,"Ort"]
[null,"Osten"]
[null,"Park"]
[null,"Pension"]
[null,"Platz"]
[null,"rechts"]
[null,"Region"]
[null,"Restaurant"]
[null,"Ring"]
[null,"Schloss"]
[null,"Stadt"]
[null,"Standort"]
[null,"Station"]
[null,"Straße"]
[null,"Süden"]
[null,"Umgebung"]
[null,"Unterkunft"]
[null,"Westen"]
[null,"Zentrale"]
[null,"Zentrum"]
[null,"Zimmer"]
[]
[null,"Adjectives: Dative","41-Adj: Dat."]
["41-Adj: Dat.","alten"]
["41-Adj: Dat.","bekannten"]
["41-Adj: Dat.","deutschen"]
["41-Adj: Dat.","eigenen"]
["41-Adj: Dat.","gesamten"]
["41-Adj: Dat.","heutigen"]
["41-Adj: Dat.","neuem"]
["41-Adj: Dat.","persönlichen"]
["41-Adj: Dat.","privaten"]
["41-Adj: Dat.","vergangenen"]
["41-Adj: Dat.","zweiten"]
[]
[null,"Adjectives: Nominative 2","42-Ad: Nom. 2"]
["42-Ad: Nom. 2","ähnlichen"]
["42-Ad: Nom. 2","aktive"]
["42-Ad: Nom. 2","ehemalige"]
["42-Ad: Nom. 2","eigenes"]
["42-Ad: Nom. 2","einfache"]
["42-Ad: Nom. 2","einfachen"]
["42-Ad: Nom. 2","externe"]
["42-Ad: Nom. 2","freien"]
["42-Ad: Nom. 2","gelber"]
["42-Ad: Nom. 2","gleichen"]
["42-Ad: Nom. 2","günstige"]
["42-Ad: Nom. 2","höchste"]
["42-Ad: Nom. 2","individuelle"]
["42-Ad: Nom. 2","interessante"]
["42-Ad: Nom. 2","jungen"]
["42-Ad: Nom. 2","letzten"]
["42-Ad: Nom. 2","möglichen"]
["42-Ad: Nom. 2","nächste"]
["42-Ad: Nom. 2","neue"]
["42-Ad: Nom. 2","neuesten"]
["42-Ad: Nom. 2","offene"]
["42-Ad: Nom. 2","öffentliches"]
["42-Ad: Nom. 2","persönliche"]
["42-Ad: Nom. 2","politischen"]
["42-Ad: Nom. 2","schönen"]
["42-Ad: Nom. 2","schöner"]
["42-Ad: Nom. 2","schöne"]
["42-Ad: Nom. 2","soziales"]
["42-Ad: Nom. 2","sozialen"]
["42-Ad: Nom. 2","soziale"]
["42-Ad: Nom. 2","starken"]
["42-Ad: Nom. 2","starke"]
["42-Ad: Nom. 2","unterschiedliche"]
["42-Ad: Nom. 2","wichtige"]
["42-Ad: Nom. 2","zusätzlichen"]
["42-Ad: Nom. 2","zusätzliche"]
[]
[null,"Adverbs 2","43-Adverbs 2"]
["43-Adverbs 2","alleine"]
["43-Adverbs 2","allerdings"]
["43-Adverbs 2","also"]
["43-Adverbs 2","anders"]
["43-Adverbs 2","ansonsten"]
["43-Adverbs 2","außen"]
["43-Adverbs 2","bald"]
["43-Adverbs 2","bisher"]
["43-Adverbs 2","dadurch"]
["43-Adverbs 2","dafür"]
["43-Adverbs 2","damals"]
["43-Adverbs 2","daran"]
["43-Adverbs 2","darauf"]
["43-Adverbs 2","darum"]
["43-Adverbs 2","davon"]
["43-Adverbs 2","denn"]
["43-Adverbs 2","derzeit"]
["43-Adverbs 2","deshalb"]
["43-Adverbs 2","deswegen"]
["43-Adverbs 2","dran"]
["43-Adverbs 2","drin"]
["43-Adverbs 2","ebenfalls"]
["43-Adverbs 2","eigentlich"]
["43-Adverbs 2","endlich"]
["43-Adverbs 2","gratis"]
["43-Adverbs 2","her"]
["43-Adverbs 2","hierher"]
["43-Adverbs 2","hiermit"]
["43-Adverbs 2","hierzu"]
["43-Adverbs 2","hinaus"]
["43-Adverbs 2","hinten"]
["43-Adverbs 2","hinzu"]
["43-Adverbs 2","insbesondere"]
["43-Adverbs 2","inzwischen"]
["43-Adverbs 2","irgendwie"]
["43-Adverbs 2","jederzeit"]
["43-Adverbs 2","lange"]
["43-Adverbs 2","mal"]
["43-Adverbs 2","mittlerweile"]
["43-Adverbs 2","möglichst"]
["43-Adverbs 2","natürlich"]
["43-Adverbs 2","nochmals"]
["43-Adverbs 2","raus"]
["43-Adverbs 2","schließlich"]
["43-Adverbs 2","soeben"]
["43-Adverbs 2","sogar"]
["43-Adverbs 2","soweit"]
["43-Adverbs 2","trotzdem"]
["43-Adverbs 2","überall"]
["43-Adverbs 2","übrigens"]
["43-Adverbs 2","unten"]
["43-Adverbs 2","unterwegs"]
["43-Adverbs 2","vielleicht"]
["43-Adverbs 2","voraus"]
["43-Adverbs 2","vorbei"]
["43-Adverbs 2","vorne"]
["43-Adverbs 2","weiterhin"]
["43-Adverbs 2","wenigstens"]
["43-Adverbs 2","wohl"]
["43-Adverbs 2","zugleich"]
["43-Adverbs 2","zumindest"]
["43-Adverbs 2","zurück"]
["43-Adverbs 2","zusammen"]
[]
[null,"Verbs: Preterite","44-V: Pret."]
["44-V: Pret.","beginnen"]
["44-V: Pret.","bevor"]
["44-V: Pret.","bleiben"]
["44-V: Pret.","brennen"]
["44-V: Pret.","dachen"]
["44-V: Pret.","erhalten"]
["44-V: Pret.","essen"]
["44-V: Pret.","fahren"]
["44-V: Pret.","finden"]
["44-V: Pret.","führen"]
["44-V: Pret.","geben"]
["44-V: Pret.","gehen"]
["44-V: Pret.","haben"]
["44-V: Pret.","kommen"]
["44-V: Pret.","können"]
["44-V: Pret.","kosen"]
["44-V: Pret.","lassen"]
["44-V: Pret.","lesen"]
["44-V: Pret.","liegen"]
["44-V: Pret.","machen"]
["44-V: Pret.","müssen"]
["44-V: Pret.","nehmen"]
["44-V: Pret.","sagen"]
["44-V: Pret.","schließen"]
["44-V: Pret.","schreiben"]
["44-V: Pret.","schwimmen"]
["44-V: Pret.","sehen"]
["44-V: Pret.","sein"]
["44-V: Pret.","spazieren"]
["44-V: Pret.","sprechen"]
["44-V: Pret.","stellen"]
["44-V: Pret.","trinken"]
["44-V: Pret.","verlieren"]
["44-V: Pret.","vorher"]
["44-V: Pret.","werden"]
["44-V: Pret.","zeigen"]
["44-V: Pret.","zuvor"]
[]
[null,"Verbs: Present Perfect","45-Pres. Per"]
["45-Pres. Per","akzeptiert"]
["45-Pres. Per","behalten"]
["45-Pres. Per","beraten"]
["45-Pres. Per","bestellt"]
["45-Pres. Per","besucht"]
["45-Pres. Per","gebracht"]
["45-Pres. Per","erfahren"]
["45-Pres. Per","erfüllt"]
["45-Pres. Per","erzählt"]
["45-Pres. Per","gegessen"]
["45-Pres. Per","gefallen"]
["45-Pres. Per","gefunden"]
["45-Pres. Per","gefragt"]
["45-Pres. Per","geführt"]
["45-Pres. Per","gegeben"]
["45-Pres. Per","gegangen"]
["45-Pres. Per","gegründet"]
["45-Pres. Per","gehabt"]
["45-Pres. Per","haben"]
["45-Pres. Per","gehalten"]
["45-Pres. Per","informiert"]
["45-Pres. Per","integriert"]
["45-Pres. Per","interessiert"]
["45-Pres. Per","gekocht"]
["45-Pres. Per","gekommen"]
["45-Pres. Per","geladen"]
["45-Pres. Per","gelaufen"]
["45-Pres. Per","gelernt"]
["45-Pres. Per","gelesen"]
["45-Pres. Per","gemocht"]
["45-Pres. Per","genannt"]
["45-Pres. Per","geprüft"]
["45-Pres. Per","gerannt"]
["45-Pres. Per","gesagt"]
["45-Pres. Per","geschlafen"]
["45-Pres. Per","geschrieben"]
["45-Pres. Per","geschwommen"]
["45-Pres. Per","gesehen"]
["45-Pres. Per","sein"]
["45-Pres. Per","gewesen"]
["45-Pres. Per","gespielt"]
["45-Pres. Per","gesprochen"]
["45-Pres. Per","gestellt"]
["45-Pres. Per","gesucht"]
["45-Pres. Per","getrunken"]
["45-Pres. Per","verbessert"]
["45-Pres. Per","vergeben"]
["45-Pres. Per","verkauft"]
["45-Pres. Per","verlassen"]
["45-Pres. Per","verletzt"]
["45-Pres. Per","veröffentlicht"]
["45-Pres. Per","verschwunden"]
["45-Pres. Per","gewählt"]
["45-Pres. Per","geworden"]
[]
[null,"Verbs: Past Perfect","46-Past Perf."]
["46-Past Perf.","behalten"]
["46-Past Perf.","erfahren"]
["46-Past Perf.","gegessen"]
["46-Past Perf.","haben"]
["46-Past Perf.","genannt"]
["46-Past Perf.","geprüft"]
["46-Past Perf.","verlassen"]
[]
[null,"Objects","47-Objects"]
["47-Objects","Bank"]
["47-Objects","Boden"]
["47-Objects","Geschenk"]
["47-Objects","Katalog"]
["47-Objects","Paket"]
["47-Objects","Plan"]
["47-Objects","Produkt"]
["47-Objects","Sache"]
["47-Objects","Schere"]
["47-Objects","Stelle"]
["47-Objects","Stück"]
["47-Objects","Zubehör"]
[]
[null,"Communication","48-Communic."]
["48-Communic.","Adresse"]
["48-Communic.","Anhang"]
["48-Communic.","Anmeldung"]
["48-Communic.","Anrede"]
["48-Communic.","Auskunft"]
["48-Communic.","Begründung"]
["48-Communic.","Bestätigung"]
["48-Communic.","Brief"]
["48-Communic.","Brief+marke"]
["48-Communic.","Computer"]
["48-Communic.","Datum+bank"]
["48-Communic.","Dialog"]
["48-Communic.","Diskussion"]
["48-Communic.","Einladung"]
["48-Communic.","Email"]
["48-Communic.","Fernsehen"]
["48-Communic.","fernsehen"]
["48-Communic.","Fernseher"]
["48-Communic.","Festplatte"]
["48-Communic.","Gespräch"]
["48-Communic.","Gruß"]
["48-Communic.","Handy"]
["48-Communic.","Information"]
["48-Communic.","Internet"]
["48-Communic.","Internet+seite"]
["48-Communic.","Interview"]
["48-Communic.","Kabel"]
["48-Communic.","Kennen+wort"]
["48-Communic.","Kommentar"]
["48-Communic.","Kommunikation"]
["48-Communic.","Kontakt"]
["48-Communic.","Lautsprecher"]
["48-Communic.","Medium"]
["48-Communic.","Meldung"]
["48-Communic.","Merken+zettel"]
["48-Communic.","Mitteilung"]
["48-Communic.","Monitor"]
["48-Communic.","Nachricht"]
["48-Communic.","Netz"]
["48-Communic.","Netz+werk"]
["48-Communic.","Notiz"]
["48-Communic.","Papier"]
["48-Communic.","Post"]
["48-Communic.","Post+fach"]
["48-Communic.","Post+karte"]
["48-Communic.","post+leiten+zahl"]
["48-Communic.","Presse"]
["48-Communic.","Profil"]
["48-Communic.","Radio"]
["48-Communic.","Rechner"]
["48-Communic.","Rede"]
["48-Communic.","Sender"]
["48-Communic.","Sendung"]
["48-Communic.","Suche"]
["48-Communic.","Suchen+maschine"]
["48-Communic.","Tasche+buch"]
["48-Communic.","Tastatur"]
["48-Communic.","Taste"]
["48-Communic.","Telefon"]
["48-Communic.","Telefon+buch"]
["48-Communic.","Thema"]
["48-Communic.","Vorwahl"]
["48-Communic.","Zeitschrift"]
["48-Communic.","Zeitung"]
[]
[null,"Verbs: Future 1","49-V: Fut. 1"]
["49-V: Fut. 1","abbrechen"]
["49-V: Fut. 1","anbieten"]
["49-V: Fut. 1","aufgeben"]
["49-V: Fut. 1","beantworten"]
["49-V: Fut. 1","behalten"]
["49-V: Fut. 1","benötigen"]
["49-V: Fut. 1","beraten"]
["49-V: Fut. 1","bieten"]
["49-V: Fut. 1","bleiben"]
["49-V: Fut. 1","einkaufen"]
["49-V: Fut. 1","einstellen"]
["49-V: Fut. 1","erfolgen"]
["49-V: Fut. 1","erklären"]
["49-V: Fut. 1","erscheinen"]
["49-V: Fut. 1","erwarten"]
["49-V: Fut. 1","erweitern"]
["49-V: Fut. 1","erwerben"]
["49-V: Fut. 1","essen"]
["49-V: Fut. 1","folgen"]
["49-V: Fut. 1","gehen"]
["49-V: Fut. 1","gehören"]
["49-V: Fut. 1","handeln"]
["49-V: Fut. 1","herunterladen"]
["49-V: Fut. 1","installieren"]
["49-V: Fut. 1","kosten"]
["49-V: Fut. 1","lieben"]
["49-V: Fut. 1","lösen"]
["49-V: Fut. 1","merken"]
["49-V: Fut. 1","nachfragen"]
["49-V: Fut. 1","prüfen"]
["49-V: Fut. 1","reden"]
["49-V: Fut. 1","rufen"]
["49-V: Fut. 1","schauen"]
["49-V: Fut. 1","schützen"]
["49-V: Fut. 1","sichern"]
["49-V: Fut. 1","sparen"]
["49-V: Fut. 1","sprechen"]
["49-V: Fut. 1","stehen"]
["49-V: Fut. 1","teilen"]
["49-V: Fut. 1","testen"]
["49-V: Fut. 1","unterstützen"]
["49-V: Fut. 1","verdienen"]
["49-V: Fut. 1","vergeben"]
["49-V: Fut. 1","vergessen"]
["49-V: Fut. 1","verlassen"]
["49-V: Fut. 1","verwenden"]
["49-V: Fut. 1","vorschlagen"]
["49-V: Fut. 1","warten"]
["49-V: Fut. 1","wechseln"]
["49-V: Fut. 1","wenden"]
["49-V: Fut. 1","werden"]
["49-V: Fut. 1","wirken"]
["49-V: Fut. 1","wissen"]
["49-V: Fut. 1","wohnen"]
["49-V: Fut. 1","wünschen"]
["49-V: Fut. 1","zählen"]
["49-V: Fut. 1","zitieren"]
[]
[null,"Education","50-Education"]
["50-Education","Akademie"]
["50-Education","Ausbildung"]
["50-Education","Bibliothek"]
["50-Education","Bildung"]
["50-Education","Erziehung"]
["50-Education","Fachbereich"]
["50-Education","Forschung"]
["50-Education","Grund+schule"]
["50-Education","Hochschule"]
["50-Education","Institut"]
["50-Education","Kindergarten"]
["50-Education","Klasse"]
["50-Education","Lehre"]
["50-Education","Leser"]
["50-Education","Note"]
["50-Education","Prüfung"]
["50-Education","Schule"]
["50-Education","Seminar"]
["50-Education","Stift"]
["50-Education","Studium"]
["50-Education","Test"]
["50-Education","Training"]
["50-Education","überlegen"]
["50-Education","Übung"]
["50-Education","Uni"]
["50-Education","Universität"]
["50-Education","Unterricht"]
["50-Education","Weiterbildung"]
[]
[null,"Science","51-Science"]
["51-Science","Achtung"]
["51-Science","Analyse"]
["51-Science","Biologie"]
["51-Science","Definition"]
["51-Science","Diesel"]
["51-Science","Energie"]
["51-Science","Erfindung"]
["51-Science","Gas"]
["51-Science","Grad"]
["51-Science","Kenntnis"]
["51-Science","Kunststoff"]
["51-Science","Landwirtschaft"]
["51-Science","Maschine"]
["51-Science","Mathematik"]
["51-Science","Methode"]
["51-Science","Motor"]
["51-Science","Nachweis"]
["51-Science","Philosophie"]
["51-Science","Physik"]
["51-Science","Praktikum"]
["51-Science","Statistik"]
["51-Science","Studie"]
["51-Science","Technik"]
["51-Science","Temperatur"]
["51-Science","Theorie"]
["51-Science","Wissen"]
["51-Science","Wissenschaft"]
[]
[null,"Verbs: Future Perfect","52-Fut. Per."]
["52-Fut. Per.","gegessen"]
["52-Fut. Per.","gefahren"]
["52-Fut. Per.","gegangen"]
["52-Fut. Per.","haben"]
["52-Fut. Per.","gekauft"]
["52-Fut. Per.","gelesen"]
["52-Fut. Per.","gesagt"]
["52-Fut. Per.","geschlossen"]
["52-Fut. Per.","sein"]
["52-Fut. Per.","werden"]
[]
[null,"Verbs: Relfexive","53-V: Refl."]
["53-V: Refl.","anmelden"]
["53-V: Refl.","anschauen"]
["53-V: Refl.","befinden"]
["53-V: Refl.","bieten"]
["53-V: Refl.","bilden"]
["53-V: Refl.","eintragen"]
["53-V: Refl.","sich"]
["53-V: Refl.","ergeben"]
["53-V: Refl.","sich"]
["53-V: Refl.","freuen"]
["53-V: Refl.","haben"]
["53-V: Refl.","ich"]
["53-V: Refl.","ihr"]
["53-V: Refl.","interessieren"]
["53-V: Refl.","lohnen"]
["53-V: Refl.","machen"]
["53-V: Refl.","melden"]
["53-V: Refl.","sehen"]
["53-V: Refl.","gesetzt"]
["53-V: Refl.","setzen"]
["53-V: Refl.","sich"]
["53-V: Refl.","sollen"]
["53-V: Refl.","sorgen"]
["53-V: Refl.","verlaufen"]
["53-V: Refl.","waschen"]
["53-V: Refl.","werden"]
["53-V: Refl.","wir"]
["53-V: Refl.","wünschen"]
[]
[null,"Business 1","54-Business 1"]
["54-Business 1","Aktie"]
["54-Business 1","Arbeit"]
["54-Business 1","Artikel"]
["54-Business 1","Bäckerei"]
["54-Business 1","Beitrag"]
["54-Business 1","Beratung"]
["54-Business 1","Bestellung"]
["54-Business 1","Bewerbung"]
["54-Business 1","Business"]
["54-Business 1","Cent"]
["54-Business 1","Dokument"]
["54-Business 1","Dollar"]
["54-Business 1","Euro"]
["54-Business 1","Fabrik"]
["54-Business 1","Finanzierung"]
["54-Business 1","Gebot"]
["54-Business 1","Geld"]
["54-Business 1","Geschäft"]
["54-Business 1","Gewinn"]
["54-Business 1","Handel"]
["54-Business 1","Inhaber"]
["54-Business 1","Job"]
["54-Business 1","Karriere"]
["54-Business 1","Kasse"]
["54-Business 1","Kauf"]
["54-Business 1","Klein+anzeige"]
["54-Business 1","Laden"]
["54-Business 1","Management"]
["54-Business 1","Markt+platz"]
["54-Business 1","mieten"]
["54-Business 1","Organisation"]
["54-Business 1","Preis"]
["54-Business 1","Projekt"]
["54-Business 1","Unternehmen"]
["54-Business 1","Wert"]
["54-Business 1","Wettbewerb"]
[]
[null,"Language","55-Language"]
["55-Language","Bedeutung"]
["55-Language","Begriff"]
["55-Language","Bericht"]
["55-Language","Beschreibung"]
["55-Language","Buch"]
["55-Language","Erklärung"]
["55-Language","Geschichte"]
["55-Language","Hand+buch"]
["55-Language","Idee"]
["55-Language","Kapitel"]
["55-Language","Konzept"]
["55-Language","Meinung"]
["55-Language","Satz"]
["55-Language","Schrift"]
["55-Language","Sprache"]
["55-Language","Text"]
["55-Language","Titel"]
["55-Language","Übersetzung"]
["55-Language","Unterhaltung"]
["55-Language","Verzeichnis"]
["55-Language","Wort"]
["55-Language","Wort+buch"]
["55-Language","Zeichen"]
["55-Language","Zusammenfassung"]
["55-Language","Zustimmung"]

{"sheet":"Sheet1","index":3,"n_rows":13,"n_cols":7,"rows_kept":13}
[]
[]
[]
[]
[{"$nulls":4},"die Ente",null,{"$f":"IF(AND(LEFT(E5,1)=\"d\",MID(E5,4,1)=\" \"),RIGHT(E5,LEN(E5)-4),E5)","v":"Ente"}]
[{"$nulls":4},"alt",null,{"$f":"IF(AND(LEFT(E6,1)=\"d\",MID(E6,4,1)=\" \"),RIGHT(E6,LEN(E6)-4),E6)","v":"alt"}]
[{"$nulls":4},"der Mann",null,"Mann"]
[{"$nulls":4},"das Bein",null,"Bein"]
[{"$nulls":4},"die Tassen",null,"Tassen"]
[{"$nulls":4},"die Umwelt",null,"Umwelt"]
[{"$nulls":4},"das Sofa",null,"Sofa"]
[{"$nulls":4},"es",null,"es"]
[{"$nulls":4},"hallo",null,"hallo"]